{"text_format":"1","workbook":"xlsx","n_sheets":8,"sheets":["Home","Compostable Cup","Mug Discount","ECO Comparison","2016 Data","Descriptive Model","LandfillDiversion","Mug Discount Calc"],"not_rendered":{"charts":6,"images":24,"macros":1,"external_links":0,"defined_names":22,"comments":0,"pivot_tables":3},"unopened":[],"bounds":{"document_bytes":16777216,"sheet_cells":100000,"rows_first":2000,"rows_last":500,"rows_between":2000,"halvings":0,"cell_chars":16384,"cell_head_chars":4096},"cells_cut":0,"cells_raw":0,"read":"whole","date_system":"1900"}

{"sheet":"Home","index":0,"n_rows":18,"n_cols":7,"rows_kept":18,"cut":false,"hidden":false,"merged":[]}
[]
[]
[]
[]
[]
[]
[]
[]
[]
[]
[]
[]
[]
[]
[]
[null,null,{"$f":"'Mug Discount Calc'!F31","v":"Bottom Line Change:"},{"$f":"LandfillDiversion!K26","v":-486.34999999999854},null,{"$f":"'Mug Discount Calc'!F31","v":"Bottom Line Change:"},{"$f":"'Mug Discount Calc'!F32","v":-14.480000000003201}]
[]
[null,null,{"$f":"LandfillDiversion!I25","v":"New Profits After Cup Costs:"},{"$f":"New_Profits_After_Cup_Costs","v":"$40,331.75"},null,{"$f":"'Mug Discount Calc'!H24","v":"New Profit After Mug Discount:"},{"$f":"'Mug Discount Calc'!I24","v":40803.619999999995}]

{"sheet":"Compostable Cup","index":1,"n_rows":46,"n_cols":22,"rows_kept":46,"cut":false,"hidden":false,"merged":[]}
[]
[]
[null,null,null,null,null,null,null,null,null,null,null,null,null,null,null,null,null,null,null,null,"Static"]
[]
[null,null,null,null,null,null,null,null,null,null,null,null,null,null,null,null,null,null,null,null,{"$f":"\"Data is \"&U3","v":"Data is Static"},"Static"]
[null,null,null,null,null,null,null,null,null,null,null,null,null,null,null,null,{"$f":"LandfillDiversion!J25","v":"$40,331.75"},null,null,null,null,"Dynamic"]
[null,null,null,null,null,null,null,null,null,null,null,null,null,null,null,null,{"$f":"LandfillDiversion!K26","v":-486.34999999999854}]
[]
[]
[]
[]
[]
[]
[]
[]
[]
[]
[]
[]
[]
[]
[]
[]
[]
[]
[]
[]
[]
[]
[]
[]
[]
[]
[]
[]
[]
[]
[]
[]
[]
[]
[]
[]
[]
[]
["Team members - Alyssa Aquino, Dakota Koenig, Kate Olson, Cristian Puente-Ortiz, Nick Schmidt"]

{"sheet":"Mug Discount","index":2,"n_rows":25,"n_cols":13,"rows_kept":25,"cut":false,"hidden":false,"merged":[]}
[]
[]
[]
[null,null,null,null,null,null,null,null,null,"Static",null,"Static","Dynamic"]
[]
[null,null,null,null,null,null,null,null,null,{"$f":"\"Data is \"&J4","v":"Data is Static"}]
[]
[]
[]
[]
[]
[]
[]
[]
[]
[]
[]
[]
[]
[]
[]
[]
[null,{"$f":"'Mug Discount Calc'!C19","v":"New Customer Demand Median:"},{"$f":"'Mug Discount Calc'!C20","v":13481.45},{"$f":"'Mug Discount Calc'!E25","v":"New Annual Revenue: "},{"$f":"'Mug Discount Calc'!E26","v":"$43,410.27"},null,"New Annual Costs:",{"$f":"DOLLAR('Mug Discount Calc'!E24+2000,2)","v":"$2,606.65"}]
[null,null,{"$f":"'Mug Discount Calc'!C21","v":"+1,758.45"}]
[null,"Percent Customer Increase:",{"$f":"'Mug Discount Calc'!B20","v":0.15},{"$f":"IF('Mug Discount Calc'!D32>0,\"Revenue Gained:\",\"Revenue Lost\")","v":"Revenue Gained:"},{"$f":"IF('Mug Discount Calc'!D32>0,\"+\",\"-\")&DOLLAR('Mug Discount Calc'!D32)","v":"+$2,006.02"},null,{"$f":"'Mug Discount Calc'!E31","v":"Cost Increases:"},{"$f":"DOLLAR('Mug Discount Calc'!E32,2)","v":"$2,020.50"}]

{"sheet":"ECO Comparison","index":3,"n_rows":3,"n_cols":26,"rows_kept":3,"cut":false,"hidden":false,"merged":[]}
[]
[]
[null,null,null,null,null,null,null,null,null,null,null,null,null,null,null,null,null,null,null,null,null,null,null,null,"Static","Dynamic"]

{"sheet":"2016 Data","index":4,"n_rows":0,"n_cols":0,"rows_kept":0,"cut":false,"hidden":false,"merged":[]}

{"sheet":"Descriptive Model","index":5,"n_rows":10,"n_cols":7,"rows_kept":10,"cut":false,"hidden":false,"merged":[]}
["Date (Year)","2016"]
[]
[null,"",null,null,"Number of Cups",null,"Cost"]
[null,1,null,null,11723,null,{"$f":"0.05*E4","v":586.15}]
["Item","Sum of Sales Price","Sum of Qty"]
["Hot drink",39311.75,11723,null,"Revenue",null,"Profit After Cup Costs "]
[null,null,null,null,{"$f":"GETPIVOTDATA(\"[Measures].[Sum of Transaction Revenue]\",'Mug Discount Calc'!$L$17)","v":41404.25},null,{"$f":"E7-G4","v":40818.1}]
[]
[]
["December 2018 Team members - Alyssa Aquino, Dakota Koenig, Kate Olson, Cristian Puente-Ortiz, Nick Schmidt "]

{"sheet":"LandfillDiversion","index":6,"n_rows":1015,"n_cols":24,"rows_kept":1015,"cut":false,"hidden":false,"merged":[[1,2,1,3],[0,0,0,14],[6,5,6,6]]}
["Compostable Cup Data"]
[null,null,"Marketing Impact on Consumers",null,null,null,null,"2016 Demand",{"$f":"_2016_Demand","v":11723},null,null,null,11]
[null,null,"Probability"," % customer increase",null,null,null,"2016 pounds discarded",{"$f":"(11*I2)/453.592","v":284.29293285595867},null,null,"Advertising Cost: ",2000,{"$f":"L3&TEXT(M3,\"$#,#\")","v":"Advertising Cost: $2,000"}]
[null,0,0.25,0.1,null,"Consumer Increase",{"$f":"IF($D$10=0,0.15,VLOOKUP(RAND(),B4:D7,3,TRUE))","v":0.15},"New Demand",{"$f":"(1+G4)*I2","v":13481.449999999999},null,null,"Cost per New Cup: ",{"$f":"M2/100","v":0.11},{"$f":"L4&TEXT(M4,\"$0.00\")","v":"Cost per New Cup: $0.11"},null,0.05,null,null,null,null,null,null,null,0]
[null,{"$f":"B4+C4","v":0.25},0.4,0.15,null,"Success Rate",{"$f":"IF($D$10=0,0.03,RANDBETWEEN(3,10)/100)","v":0.03},{"$f":"IF(Skew>1,\"New Customer Demand Median:\",\"New Customer Demand Average:\")","v":"New Customer Demand Median:"},{"$f":"IF(Skew>1,MEDIAN(Q15:Q1014),AVERAGE(Q15:Q1014))","v":13481.449999999999},null,null,"Sales Price: ",{"$f":"M6/100","v":3.25},{"$f":"L5&TEXT(M5,\"$#,#.00\")","v":"Sales Price: $3.25"},null,null,null,null,null,null,null,null,null,{"$f":"X4+0.01","v":0.01}]
[null,{"$f":"B5+C5","v":0.65},0.25,0.2,null,"Dispose of Cup Properly",{"$f":"IF(D10=0,404,_xlfn.BINOM.INV(New_Customer_Demand_Central_Tendency,G5,RAND()))","v":404},null,"Revenue",{"$f":"M5*I4","v":43814.712499999994},null,null,325,null,null,null,null,null,null,null,null,null,null,{"$f":"X5+0.01","v":0.02}]
[null,0.9,0.1,0.3,null,"Lanfill Data",null,null,"Cost",{"$f":"M3+(M4*I4)","v":3482.9594999999999},null,null,null,null,null,null,null,null,null,null,null,null,null,0.03]
[null,1,null,null,null,"Avg. Weight (g) of Coffee Cup",11,{"$f":"\"Percent Customer Increase:\"","v":"Percent Customer Increase:"},{"$f":"(I5-I2)/I2","v":0.14999999999999991},null,null,null,2000,null,null,null,null,null,null,null,null,null,null,0.04]
[null,null,null,null,null,"Diverted from Landfill (lbs)",{"$f":"(Avg._Weight__g__of_Coffee_Cup*G6)/453.592","v":9.7973509232967082},null,{"$f":"IF((I5-I2)>0,\"+\"&TEXT(ROUND((I5-I2),2),\"#,#.00\"),IF((I5-I2)<0,\"-\"&TEXT(ROUND((I5-I2),2),\"#,#.00\"),I5-I2))","v":"+1,758.45"},null,null,null,null,null,null,null,null,null,null,null,null,null,null,0.05]
[null,null,null,{"$f":"IF('Compostable Cup'!U3=\"Static\",0,1)","v":0},null,{"$f":"\"- \"&TEXT(ROUND(G10,0),\"#,#\")&\" Ping-Pong Balls\"","v":"- 1,646 Ping-Pong Balls"},{"$f":"G9/0.00595248","v":1645.9275668791342},"How Many Cups are discarded improperly:",{"$f":"(1-G5)*New_Customer_Demand_Central_Tendency","v":13077.006499999998}]
[null,null,null,null,null,{"$f":"\"- \"&TEXT(ROUND(G11,0),\"#,#\")&\" iPhone 8 Devices\"","v":"- 30 iPhone 8 Devices"},{"$f":"G9/0.32625","v":30.030194400909451},"Weight in Landfill",{"$f":"(I10*Avg._Weight__g__of_Coffee_Cup)/453.592","v":317.12876660082179}]
[null,null,null,null,null,{"$f":"\"- \"&TEXT(ROUND(G12,0),\"#,#\")&\" U.S. Quarters (That's Equal to \"&TEXT(ROUND(G12,1)*0.25,\"$0.00\")&\")\"","v":"- 784 U.S. Quarters (That's Equal to $195.95)"},{"$f":"G9/0.01250021","v":783.77490644530837},null,{"$f":"ROUND(I11,2)&\" pounds are still discarded in landfills.\"","v":"317.13 pounds are still discarded in landfills."}]
[null,null,null,null,"MAX Revenue:",null,null,null,"MAX COST:",null,"Skew",{"$f":"SKEW(Q15:Q1014)","v":1.001502880698883},null,null,null,null,"New Demand",null,"MAX:",null,null,null,null,{"$f":"X9+0.01","v":6.0000000000000005E-2}]
[null,null,null,{"$f":"J6","v":43814.712499999994},{"$f":"\"Highest Revenue Simulated: \"&DOLLAR(MAX(D15:D1014),2)","v":"Highest Revenue Simulated: $43,814.71"},null,null,{"$f":"J7","v":3482.9594999999999},{"$f":"\"Highest Cost Simulated: \"&DOLLAR(MAX(H15:H1014),2)","v":"Highest Cost Simulated: $3,482.96"},null,null,null,null,"Profit (Rev-Cost)",{"$f":"\"Highest Profit Simulated: \"&DOLLAR(MAX(M15:M1014),2)","v":"Highest Profit Simulated: $999.00"},null,{"$f":"I4","v":13481.449999999999},null,{"$f":"\"Highest Demand Simulated: \"&TEXT(MAX(Q15:Q1014),\"#,#.00\")","v":"Highest Demand Simulated: 13,481.45"},null,null,null,null,{"$f":"X13+0.01","v":7.0000000000000007E-2}]
[null,null,1,43814.712499999994,{"$f":"\"Median Revenue Simulated: \"&DOLLAR(MEDIAN(D15:D1014),2)","v":"Median Revenue Simulated: $43,814.71"},null,1,3482.9594999999999,{"$f":"\"Median Cost Simulated: \"&DOLLAR(MEDIAN(H15:H1014),2)","v":"Median Cost Simulated: $3,482.96"},{"$f":"AVERAGE($D$15:$D$1014)-AVERAGE($H$15:$H$1014)","v":40331.752999999197},"New Profit",null,null,{"$f":"D14-H14","v":40331.752999999997},{"$f":"\"Median Profit Simulated: \"&DOLLAR(MEDIAN(M15:M1014),2)","v":"Median Profit Simulated: $500.00"},1,13481.449999999999,null,{"$f":"\"Median Demand Simulated: \"&TEXT(MEDIAN(Q15:Q1014),\"#,##.00\")","v":"Median Demand Simulated: 13,481.45"},null,null,null,null,0.08]
[null,null,2,43814.712499999994,{"$f":"\"Average Revenue Simulated: \"&DOLLAR(AVERAGE(D15:D1014),2)","v":"Average Revenue Simulated: $43,814.71"},null,2,3482.9594999999999,{"$f":"\"Average Cost Simulated: \"&DOLLAR(AVERAGE(H15:H1014),2)","v":"Average Cost Simulated: $3,482.96"},{"$f":"'Descriptive Model'!G7","v":40818.1},"Original Profit",null,1,40331.752999999997,{"$f":"\"Average Profit Simulated: \"&DOLLAR(AVERAGE(M15:M1014),2)","v":"Average Profit Simulated: $500.00"},2,13481.449999999999,null,{"$f":"\"Average Demand Simulated: \"&TEXT(AVERAGE(Q15:Q1014),\"#,###.00\")","v":"Average Demand Simulated: 13,481.45"},null,null,null,null,0.09]
[null,null,3,43814.712499999994,{"$f":"\"Lowest Revenue Simulated: \"&DOLLAR(MIN(D15:D1014),2)","v":"Lowest Revenue Simulated: $43,814.71"},null,3,3482.9594999999999,{"$f":"\"Lowest Cost Simulated: \"&DOLLAR(MIN(H15:H1014),2)","v":"Lowest Cost Simulated: $3,482.96"},{"$f":"J15-J16","v":-486.34700000080193},"Gains",null,2,40331.752999999997,{"$f":"\"Lowest Profit Simulated: \"&DOLLAR(MIN(M15:M1014),2)","v":"Lowest Profit Simulated: $1.00"},3,13481.449999999999,null,{"$f":"\"Lowest Demand Simulated: \"&TEXT(MIN(Q15:Q1014),\"#,#.00\")","v":"Lowest Demand Simulated: 13,481.45"},null,null,null,null,9.9999999999999992E-2]
[null,null,4,43814.712499999994,null,null,4,3482.9594999999999,null,null,null,null,3,40331.752999999997,null,4,13481.449999999999,null,null,null,null,null,null,0.10999999999999999]
[null,null,5,43814.712499999994,{"$f":"SKEW(D15:D1014)","v":1.001502880698883},{"$f":"E20&\" Revenue\"","v":"Median Revenue"},5,3482.9594999999999,{"$f":"SKEW(H15:H1014)","v":1.001502880698883},{"$f":"I20&\" Cost\"","v":"Median Cost"},null,null,4,40331.752999999997,null,5,13481.449999999999,null,null,null,null,null,null,0.11999999999999998]
[null,null,6,43814.712499999994,{"$f":"IF(E19>1,\"Median\",\"Average\")","v":"Median"},{"$f":"IF(E19>1,DOLLAR(MEDIAN(D15:D1014)),DOLLAR(AVERAGE(D15:D1014)))","v":"$43,814.71"},6,3482.9594999999999,{"$f":"IF(I19>1,\"Median\",\"Average\")","v":"Median"},{"$f":"DOLLAR(IF(I19>1,MEDIAN(H15:H1014),AVERAGE(H15:H1014)))","v":"$3,482.96"},null,null,5,40331.752999999997,null,6,13481.449999999999,null,null,null,null,null,null,0.12999999999999998]
[null,null,7,43814.712499999994,null,null,7,3482.9594999999999,null,null,null,null,6,40331.752999999997,null,7,13481.449999999999,null,null,null,null,null,null,0.13999999999999999]
[null,null,8,43814.712499999994,"Old Revenue",41404.25,8,3482.9594999999999,"Old Costs",586.15,null,null,7,40331.752999999997,null,8,13481.449999999999,null,null,null,null,null,null,0.15]
[null,null,9,43814.712499999994,"Increase in Rev:",{"$f":"DOLLAR(VALUE(F20)-Old_Revenue,2)","v":"$2,410.46"},9,3482.9594999999999,"Increase in Costs:",{"$f":"DOLLAR(MAX(VALUE(J20),J22)-MIN(VALUE(J20),J22),2)","v":"$2,896.81"},null,null,8,40331.752999999997,null,9,13481.449999999999,null,null,null,null,null,null,0.16]
[null,null,10,43814.712499999994,null,null,10,3482.9594999999999,null,null,"Old Profit",40818.1,9,40331.752999999997,null,10,13481.449999999999,null,null,null,null,null,null,0.17]
[null,null,11,43814.712499999994,null,null,11,3482.9594999999999,"New Profits After Cup Costs:",{"$f":"DOLLAR(F20-J20,2)","v":"$40,331.75"},null,null,10,40331.752999999997,null,11,13481.449999999999,null,null,null,null,null,null,0.18000000000000002]
[null,null,12,43814.712499999994,null,null,12,3482.9594999999999,"Compostable Cups Will Lead to a Profit ",{"$f":"IF(K26>0,\"Gain of:\",IF(K26<0,\"Loss of:\",IF(K26=0,\"the same as 2016\")))","v":"Loss of:"},{"$f":"J25-L24","v":-486.34999999999854},null,11,40331.752999999997,null,12,13481.449999999999,null,null,null,null,null,null,0.19000000000000003]
[null,null,13,43814.712499999994,null,null,13,3482.9594999999999,{"$f":"I26&J26","v":"Compostable Cups Will Lead to a Profit Loss of:"},null,null,null,12,40331.752999999997,null,13,13481.449999999999,null,null,null,null,null,null,0.20000000000000004]
[null,null,14,43814.712499999994,null,null,14,3482.9594999999999,null,null,null,null,13,40331.752999999997,null,14,13481.449999999999,null,null,null,null,null,null,0.21000000000000005]
[null,null,15,43814.712499999994,null,null,15,3482.9594999999999,"Profit Standard Deviation: +/- ",{"$f":"_xlfn.STDEV.S(N16:N1015)","v":7.3523943069878551E-10},null,null,14,40331.752999999997,null,15,13481.449999999999,null,null,null,null,null,null,0.22000000000000006]
[null,null,16,43814.712499999994,null,null,16,3482.9594999999999,{"$f":"I29&DOLLAR(ROUND(J29,2))","v":"Profit Standard Deviation: +/- $0.00"},null,null,null,15,40331.752999999997,null,16,13481.449999999999,null,null,null,null,null,null,0.23000000000000007]
[null,null,17,43814.712499999994,null,null,17,3482.9594999999999,null,null,null,null,16,40331.752999999997,null,17,13481.449999999999,null,null,null,null,null,null,0.24000000000000007]
[null,null,18,43814.712499999994,null,null,18,3482.9594999999999,null,null,null,null,17,40331.752999999997,null,18,13481.449999999999,null,null,null,null,null,null,0.25000000000000006]
[null,null,19,43814.712499999994,null,null,19,3482.9594999999999,null,null,null,null,18,40331.752999999997,null,19,13481.449999999999,null,null,null,null,null,null,0.26000000000000006]
[null,null,20,43814.712499999994,null,null,20,3482.9594999999999,null,null,null,null,19,40331.752999999997,null,20,13481.449999999999,null,null,null,null,null,null,0.27000000000000007]
[null,null,21,43814.712499999994,null,null,21,3482.9594999999999,null,null,null,null,20,40331.752999999997,null,21,13481.449999999999,null,null,null,null,null,null,0.28000000000000008]
[null,null,22,43814.712499999994,null,null,22,3482.9594999999999,null,null,null,null,21,40331.752999999997,null,22,13481.449999999999,null,null,null,null,null,null,0.29000000000000009]
[null,null,23,43814.712499999994,null,null,23,3482.9594999999999,null,null,null,null,22,40331.752999999997,null,23,13481.449999999999,null,null,null,null,null,null,0.3000000000000001]
[null,null,24,43814.712499999994,null,null,24,3482.9594999999999,null,null,null,null,23,40331.752999999997,null,24,13481.449999999999,null,null,null,null,null,null,0.31000000000000011]
[null,null,25,43814.712499999994,null,null,25,3482.9594999999999,null,null,null,null,24,40331.752999999997,null,25,13481.449999999999,null,null,null,null,null,null,0.32000000000000012]
[null,null,26,43814.712499999994,null,null,26,3482.9594999999999,null,null,null,null,25,40331.752999999997,null,26,13481.449999999999,null,null,null,null,null,null,0.33000000000000013]
[null,null,27,43814.712499999994,null,null,27,3482.9594999999999,null,null,null,null,26,40331.752999999997,null,27,13481.449999999999,null,null,null,null,null,null,0.34000000000000014]
[null,null,28,43814.712499999994,null,null,28,3482.9594999999999,null,null,null,null,27,40331.752999999997,null,28,13481.449999999999,null,null,null,null,null,null,0.35000000000000014]
[null,null,29,43814.712499999994,null,null,29,3482.9594999999999,null,null,null,null,28,40331.752999999997,null,29,13481.449999999999,null,null,null,null,null,null,0.36000000000000015]
[null,null,30,43814.712499999994,null,null,30,3482.9594999999999,null,null,null,null,29,40331.752999999997,null,30,13481.449999999999,null,null,null,null,null,null,0.37000000000000016]
[null,null,31,43814.712499999994,null,null,31,3482.9594999999999,null,null,null,null,30,40331.752999999997,null,31,13481.449999999999,null,null,null,null,null,null,0.38000000000000017]
[null,null,32,43814.712499999994,null,null,32,3482.9594999999999,null,null,null,null,31,40331.752999999997,null,32,13481.449999999999,null,null,null,null,null,null,0.39000000000000018]
[null,null,33,43814.712499999994,null,null,33,3482.9594999999999,null,null,null,null,32,40331.752999999997,null,33,13481.449999999999,null,null,null,null,null,null,0.40000000000000019]
[null,null,34,43814.712499999994,null,null,34,3482.9594999999999,null,null,null,null,33,40331.752999999997,null,34,13481.449999999999,null,null,null,null,null,null,0.4100000000000002]
[null,null,35,43814.712499999994,null,null,35,3482.9594999999999,null,null,null,null,34,40331.752999999997,null,35,13481.449999999999,null,null,null,null,null,null,0.42000000000000021]
[null,null,36,43814.712499999994,null,null,36,3482.9594999999999,null,null,null,null,35,40331.752999999997,null,36,13481.449999999999,null,null,null,null,null,null,0.43000000000000022]
[null,null,37,43814.712499999994,null,null,37,3482.9594999999999,null,null,null,null,36,40331.752999999997,null,37,13481.449999999999,null,null,null,null,null,null,0.44000000000000022]
[null,null,38,43814.712499999994,null,null,38,3482.9594999999999,null,null,null,null,37,40331.752999999997,null,38,13481.449999999999,null,null,null,null,null,null,0.45000000000000023]
[null,null,39,43814.712499999994,null,null,39,3482.9594999999999,null,null,null,null,38,40331.752999999997,null,39,13481.449999999999,null,null,null,null,null,null,0.46000000000000024]
[null,null,40,43814.712499999994,null,null,40,3482.9594999999999,null,null,null,null,39,40331.752999999997,null,40,13481.449999999999,null,null,null,null,null,null,0.47000000000000025]
[null,null,41,43814.712499999994,null,null,41,3482.9594999999999,null,null,null,null,40,40331.752999999997,null,41,13481.449999999999,null,null,null,null,null,null,0.48000000000000026]
[null,null,42,43814.712499999994,null,null,42,3482.9594999999999,null,null,null,null,41,40331.752999999997,null,42,13481.449999999999,null,null,null,null,null,null,0.49000000000000027]
[null,null,43,43814.712499999994,null,null,43,3482.9594999999999,null,null,null,null,42,40331.752999999997,null,43,13481.449999999999,null,null,null,null,null,null,0.50000000000000022]
[null,null,44,43814.712499999994,null,null,44,3482.9594999999999,null,null,null,null,43,40331.752999999997,null,44,13481.449999999999]
[null,null,45,43814.712499999994,null,null,45,3482.9594999999999,null,null,null,null,44,40331.752999999997,null,45,13481.449999999999]
[null,null,46,43814.712499999994,null,null,46,3482.9594999999999,null,null,null,null,45,40331.752999999997,null,46,13481.449999999999]
[null,null,47,43814.712499999994,null,null,47,3482.9594999999999,null,null,null,null,46,40331.752999999997,null,47,13481.449999999999]
[null,null,48,43814.712499999994,null,null,48,3482.9594999999999,null,null,null,null,47,40331.752999999997,null,48,13481.449999999999]
[null,null,49,43814.712499999994,null,null,49,3482.9594999999999,null,null,null,null,48,40331.752999999997,null,49,13481.449999999999]
[null,null,50,43814.712499999994,null,null,50,3482.9594999999999,null,null,null,null,49,40331.752999999997,null,50,13481.449999999999]
[null,null,51,43814.712499999994,null,null,51,3482.9594999999999,null,null,null,null,50,40331.752999999997,null,51,13481.449999999999]
[null,null,52,43814.712499999994,null,null,52,3482.9594999999999,null,null,null,null,51,40331.752999999997,null,52,13481.449999999999]
[null,null,53,43814.712499999994,null,null,53,3482.9594999999999,null,null,null,null,52,40331.752999999997,null,53,13481.449999999999]
[null,null,54,43814.712499999994,null,null,54,3482.9594999999999,null,null,null,null,53,40331.752999999997,null,54,13481.449999999999]
[null,null,55,43814.712499999994,null,null,55,3482.9594999999999,null,null,null,null,54,40331.752999999997,null,55,13481.449999999999]
[null,null,56,43814.712499999994,null,null,56,3482.9594999999999,null,null,null,null,55,40331.752999999997,null,56,13481.449999999999]
[null,null,57,43814.712499999994,null,null,57,3482.9594999999999,null,null,null,null,56,40331.752999999997,null,57,13481.449999999999]
[null,null,58,43814.712499999994,null,null,58,3482.9594999999999,null,null,null,null,57,40331.752999999997,null,58,13481.449999999999]
[null,null,59,43814.712499999994,null,null,59,3482.9594999999999,null,null,null,null,58,40331.752999999997,null,59,13481.449999999999]
[null,null,60,43814.712499999994,null,null,60,3482.9594999999999,null,null,null,null,59,40331.752999999997,null,60,13481.449999999999]
[null,null,61,43814.712499999994,null,null,61,3482.9594999999999,null,null,null,null,60,40331.752999999997,null,61,13481.449999999999]
[null,null,62,43814.712499999994,null,null,62,3482.9594999999999,null,null,null,null,61,40331.752999999997,null,62,13481.449999999999]
[null,null,63,43814.712499999994,null,null,63,3482.9594999999999,null,null,null,null,62,40331.752999999997,null,63,13481.449999999999]
[null,null,64,43814.712499999994,null,null,64,3482.9594999999999,null,null,null,null,63,40331.752999999997,null,64,13481.449999999999]
[null,null,65,43814.712499999994,null,null,65,3482.9594999999999,null,null,null,null,64,40331.752999999997,null,65,13481.449999999999]
[null,null,66,43814.712499999994,null,null,66,3482.9594999999999,null,null,null,null,65,40331.752999999997,null,66,13481.449999999999]
[null,null,67,43814.712499999994,null,null,67,3482.9594999999999,null,null,null,null,66,40331.752999999997,null,67,13481.449999999999]
[null,null,68,43814.712499999994,null,null,68,3482.9594999999999,null,null,null,null,67,40331.752999999997,null,68,13481.449999999999]
[null,null,69,43814.712499999994,null,null,69,3482.9594999999999,null,null,null,null,68,40331.752999999997,null,69,13481.449999999999]
[null,null,70,43814.712499999994,null,null,70,3482.9594999999999,null,null,null,null,69,40331.752999999997,null,70,13481.449999999999]
[null,null,71,43814.712499999994,null,null,71,3482.9594999999999,null,null,null,null,70,40331.752999999997,null,71,13481.449999999999]
[null,null,72,43814.712499999994,null,null,72,3482.9594999999999,null,null,null,null,71,40331.752999999997,null,72,13481.449999999999]
[null,null,73,43814.712499999994,null,null,73,3482.9594999999999,null,null,null,null,72,40331.752999999997,null,73,13481.449999999999]
[null,null,74,43814.712499999994,null,null,74,3482.9594999999999,null,null,null,null,73,40331.752999999997,null,74,13481.449999999999]
[null,null,75,43814.712499999994,null,null,75,3482.9594999999999,null,null,null,null,74,40331.752999999997,null,75,13481.449999999999]
[null,null,76,43814.712499999994,null,null,76,3482.9594999999999,null,null,null,null,75,40331.752999999997,null,76,13481.449999999999]
[null,null,77,43814.712499999994,null,null,77,3482.9594999999999,null,null,null,null,76,40331.752999999997,null,77,13481.449999999999]
[null,null,78,43814.712499999994,null,null,78,3482.9594999999999,null,null,null,null,77,40331.752999999997,null,78,13481.449999999999]
[null,null,79,43814.712499999994,null,null,79,3482.9594999999999,null,null,null,null,78,40331.752999999997,null,79,13481.449999999999]
[null,null,80,43814.712499999994,null,null,80,3482.9594999999999,null,null,null,null,79,40331.752999999997,null,80,13481.449999999999]
[null,null,81,43814.712499999994,null,null,81,3482.9594999999999,null,null,null,null,80,40331.752999999997,null,81,13481.449999999999]
[null,null,82,43814.712499999994,null,null,82,3482.9594999999999,null,null,null,null,81,40331.752999999997,null,82,13481.449999999999]
[null,null,83,43814.712499999994,null,null,83,3482.9594999999999,null,null,null,null,82,40331.752999999997,null,83,13481.449999999999]
[null,null,84,43814.712499999994,null,null,84,3482.9594999999999,null,null,null,null,83,40331.752999999997,null,84,13481.449999999999]
[null,null,85,43814.712499999994,null,null,85,3482.9594999999999,null,null,null,null,84,40331.752999999997,null,85,13481.449999999999]
[null,null,86,43814.712499999994,null,null,86,3482.9594999999999,null,null,null,null,85,40331.752999999997,null,86,13481.449999999999]
[null,null,87,43814.712499999994,null,null,87,3482.9594999999999,null,null,null,null,86,40331.752999999997,null,87,13481.449999999999]
[null,null,88,43814.712499999994,null,null,88,3482.9594999999999,null,null,null,null,87,40331.752999999997,null,88,13481.449999999999]
[null,null,89,43814.712499999994,null,null,89,3482.9594999999999,null,null,null,null,88,40331.752999999997,null,89,13481.449999999999]
[null,null,90,43814.712499999994,null,null,90,3482.9594999999999,null,null,null,null,89,40331.752999999997,null,90,13481.449999999999]
[null,null,91,43814.712499999994,null,null,91,3482.9594999999999,null,null,null,null,90,40331.752999999997,null,91,13481.449999999999]
[null,null,92,43814.712499999994,null,null,92,3482.9594999999999,null,null,null,null,91,40331.752999999997,null,92,13481.449999999999]
[null,null,93,43814.712499999994,null,null,93,3482.9594999999999,null,null,null,null,92,40331.752999999997,null,93,13481.449999999999]
[null,null,94,43814.712499999994,null,null,94,3482.9594999999999,null,null,null,null,93,40331.752999999997,null,94,13481.449999999999]
[null,null,95,43814.712499999994,null,null,95,3482.9594999999999,null,null,null,null,94,40331.752999999997,null,95,13481.449999999999]
[null,null,96,43814.712499999994,null,null,96,3482.9594999999999,null,null,null,null,95,40331.752999999997,null,96,13481.449999999999]
[null,null,97,43814.712499999994,null,null,97,3482.9594999999999,null,null,null,null,96,40331.752999999997,null,97,13481.449999999999]
[null,null,98,43814.712499999994,null,null,98,3482.9594999999999,null,null,null,null,97,40331.752999999997,null,98,13481.449999999999]
[null,null,99,43814.712499999994,null,null,99,3482.9594999999999,null,null,null,null,98,40331.752999999997,null,99,13481.449999999999]
[null,null,100,43814.712499999994,null,null,100,3482.9594999999999,null,null,null,null,99,40331.752999999997,null,100,13481.449999999999]
[null,null,101,43814.712499999994,null,null,101,3482.9594999999999,null,null,null,null,100,40331.752999999997,null,101,13481.449999999999]
[null,null,102,43814.712499999994,null,null,102,3482.9594999999999,null,null,null,null,101,40331.752999999997,null,102,13481.449999999999]
[null,null,103,43814.712499999994,null,null,103,3482.9594999999999,null,null,null,null,102,40331.752999999997,null,103,13481.449999999999]
[null,null,104,43814.712499999994,null,null,104,3482.9594999999999,null,null,null,null,103,40331.752999999997,null,104,13481.449999999999]
[null,null,105,43814.712499999994,null,null,105,3482.9594999999999,null,null,null,null,104,40331.752999999997,null,105,13481.449999999999]
[null,null,106,43814.712499999994,null,null,106,3482.9594999999999,null,null,null,null,105,40331.752999999997,null,106,13481.449999999999]
[null,null,107,43814.712499999994,null,null,107,3482.9594999999999,null,null,null,null,106,40331.752999999997,null,107,13481.449999999999]
[null,null,108,43814.712499999994,null,null,108,3482.9594999999999,null,null,null,null,107,40331.752999999997,null,108,13481.449999999999]
[null,null,109,43814.712499999994,null,null,109,3482.9594999999999,null,null,null,null,108,40331.752999999997,null,109,13481.449999999999]
[null,null,110,43814.712499999994,null,null,110,3482.9594999999999,null,null,null,null,109,40331.752999999997,null,110,13481.449999999999]
[null,null,111,43814.712499999994,null,null,111,3482.9594999999999,null,null,null,null,110,40331.752999999997,null,111,13481.449999999999]
[null,null,112,43814.712499999994,null,null,112,3482.9594999999999,null,null,null,null,111,40331.752999999997,null,112,13481.449999999999]
[null,null,113,43814.712499999994,null,null,113,3482.9594999999999,null,null,null,null,112,40331.752999999997,null,113,13481.449999999999]
[null,null,114,43814.712499999994,null,null,114,3482.9594999999999,null,null,null,null,113,40331.752999999997,null,114,13481.449999999999]
[null,null,115,43814.712499999994,null,null,115,3482.9594999999999,null,null,null,null,114,40331.752999999997,null,115,13481.449999999999]
[null,null,116,43814.712499999994,null,null,116,3482.9594999999999,null,null,null,null,115,40331.752999999997,null,116,13481.449999999999]
[null,null,117,43814.712499999994,null,null,117,3482.9594999999999,null,null,null,null,116,40331.752999999997,null,117,13481.449999999999]
[null,null,118,43814.712499999994,null,null,118,3482.9594999999999,null,null,null,null,117,40331.752999999997,null,118,13481.449999999999]
[null,null,119,43814.712499999994,null,null,119,3482.9594999999999,null,null,null,null,118,40331.752999999997,null,119,13481.449999999999]
[null,null,120,43814.712499999994,null,null,120,3482.9594999999999,null,null,null,null,119,40331.752999999997,null,120,13481.449999999999]
[null,null,121,43814.712499999994,null,null,121,3482.9594999999999,null,null,null,null,120,40331.752999999997,null,121,13481.449999999999]
[null,null,122,43814.712499999994,null,null,122,3482.9594999999999,null,null,null,null,121,40331.752999999997,null,122,13481.449999999999]
[null,null,123,43814.712499999994,null,null,123,3482.9594999999999,null,null,null,null,122,40331.752999999997,null,123,13481.449999999999]
[null,null,124,43814.712499999994,null,null,124,3482.9594999999999,null,null,null,null,123,40331.752999999997,null,124,13481.449999999999]
[null,null,125,43814.712499999994,null,null,125,3482.9594999999999,null,null,null,null,124,40331.752999999997,null,125,13481.449999999999]
[null,null,126,43814.712499999994,null,null,126,3482.9594999999999,null,null,null,null,125,40331.752999999997,null,126,13481.449999999999]
[null,null,127,43814.712499999994,null,null,127,3482.9594999999999,null,null,null,null,126,40331.752999999997,null,127,13481.449999999999]
[null,null,128,43814.712499999994,null,null,128,3482.9594999999999,null,null,null,null,127,40331.752999999997,null,128,13481.449999999999]
[null,null,129,43814.712499999994,null,null,129,3482.9594999999999,null,null,null,null,128,40331.752999999997,null,129,13481.449999999999]
[null,null,130,43814.712499999994,null,null,130,3482.9594999999999,null,null,null,null,129,40331.752999999997,null,130,13481.449999999999]
[null,null,131,43814.712499999994,null,null,131,3482.9594999999999,null,null,null,null,130,40331.752999999997,null,131,13481.449999999999]
[null,null,132,43814.712499999994,null,null,132,3482.9594999999999,null,null,null,null,131,40331.752999999997,null,132,13481.449999999999]
[null,null,133,43814.712499999994,null,null,133,3482.9594999999999,null,null,null,null,132,40331.752999999997,null,133,13481.449999999999]
[null,null,134,43814.712499999994,null,null,134,3482.9594999999999,null,null,null,null,133,40331.752999999997,null,134,13481.449999999999]
[null,null,135,43814.712499999994,null,null,135,3482.9594999999999,null,null,null,null,134,40331.752999999997,null,135,13481.449999999999]
[null,null,136,43814.712499999994,null,null,136,3482.9594999999999,null,null,null,null,135,40331.752999999997,null,136,13481.449999999999]
[null,null,137,43814.712499999994,null,null,137,3482.9594999999999,null,null,null,null,136,40331.752999999997,null,137,13481.449999999999]
[null,null,138,43814.712499999994,null,null,138,3482.9594999999999,null,null,null,null,137,40331.752999999997,null,138,13481.449999999999]
[null,null,139,43814.712499999994,null,null,139,3482.9594999999999,null,null,null,null,138,40331.752999999997,null,139,13481.449999999999]
[null,null,140,43814.712499999994,null,null,140,3482.9594999999999,null,null,null,null,139,40331.752999999997,null,140,13481.449999999999]
[null,null,141,43814.712499999994,null,null,141,3482.9594999999999,null,null,null,null,140,40331.752999999997,null,141,13481.449999999999]
[null,null,142,43814.712499999994,null,null,142,3482.9594999999999,null,null,null,null,141,40331.752999999997,null,142,13481.449999999999]
[null,null,143,43814.712499999994,null,null,143,3482.9594999999999,null,null,null,null,142,40331.752999999997,null,143,13481.449999999999]
[null,null,144,43814.712499999994,null,null,144,3482.9594999999999,null,null,null,null,143,40331.752999999997,null,144,13481.449999999999]
[null,null,145,43814.712499999994,null,null,145,3482.9594999999999,null,null,null,null,144,40331.752999999997,null,145,13481.449999999999]
[null,null,146,43814.712499999994,null,null,146,3482.9594999999999,null,null,null,null,145,40331.752999999997,null,146,13481.449999999999]
[null,null,147,43814.712499999994,null,null,147,3482.9594999999999,null,null,null,null,146,40331.752999999997,null,147,13481.449999999999]
[null,null,148,43814.712499999994,null,null,148,3482.9594999999999,null,null,null,null,147,40331.752999999997,null,148,13481.449999999999]
[null,null,149,43814.712499999994,null,null,149,3482.9594999999999,null,null,null,null,148,40331.752999999997,null,149,13481.449999999999]
[null,null,150,43814.712499999994,null,null,150,3482.9594999999999,null,null,null,null,149,40331.752999999997,null,150,13481.449999999999]
[null,null,151,43814.712499999994,null,null,151,3482.9594999999999,null,null,null,null,150,40331.752999999997,null,151,13481.449999999999]
[null,null,152,43814.712499999994,null,null,152,3482.9594999999999,null,null,null,null,151,40331.752999999997,null,152,13481.449999999999]
[null,null,153,43814.712499999994,null,null,153,3482.9594999999999,null,null,null,null,152,40331.752999999997,null,153,13481.449999999999]
[null,null,154,43814.712499999994,null,null,154,3482.9594999999999,null,null,null,null,153,40331.752999999997,null,154,13481.449999999999]
[null,null,155,43814.712499999994,null,null,155,3482.9594999999999,null,null,null,null,154,40331.752999999997,null,155,13481.449999999999]
[null,null,156,43814.712499999994,null,null,156,3482.9594999999999,null,null,null,null,155,40331.752999999997,null,156,13481.449999999999]
[null,null,157,43814.712499999994,null,null,157,3482.9594999999999,null,null,null,null,156,40331.752999999997,null,157,13481.449999999999]
[null,null,158,43814.712499999994,null,null,158,3482.9594999999999,null,null,null,null,157,40331.752999999997,null,158,13481.449999999999]
[null,null,159,43814.712499999994,null,null,159,3482.9594999999999,null,null,null,null,158,40331.752999999997,null,159,13481.449999999999]
[null,null,160,43814.712499999994,null,null,160,3482.9594999999999,null,null,null,null,159,40331.752999999997,null,160,13481.449999999999]
[null,null,161,43814.712499999994,null,null,161,3482.9594999999999,null,null,null,null,160,40331.752999999997,null,161,13481.449999999999]
[null,null,162,43814.712499999994,null,null,162,3482.9594999999999,null,null,null,null,161,40331.752999999997,null,162,13481.449999999999]
[null,null,163,43814.712499999994,null,null,163,3482.9594999999999,null,null,null,null,162,40331.752999999997,null,163,13481.449999999999]
[null,null,164,43814.712499999994,null,null,164,3482.9594999999999,null,null,null,null,163,40331.752999999997,null,164,13481.449999999999]
[null,null,165,43814.712499999994,null,null,165,3482.9594999999999,null,null,null,null,164,40331.752999999997,null,165,13481.449999999999]
[null,null,166,43814.712499999994,null,null,166,3482.9594999999999,null,null,null,null,165,40331.752999999997,null,166,13481.449999999999]
[null,null,167,43814.712499999994,null,null,167,3482.9594999999999,null,null,null,null,166,40331.752999999997,null,167,13481.449999999999]
[null,null,168,43814.712499999994,null,null,168,3482.9594999999999,null,null,null,null,167,40331.752999999997,null,168,13481.449999999999]
[null,null,169,43814.712499999994,null,null,169,3482.9594999999999,null,null,null,null,168,40331.752999999997,null,169,13481.449999999999]
[null,null,170,43814.712499999994,null,null,170,3482.9594999999999,null,null,null,null,169,40331.752999999997,null,170,13481.449999999999]
[null,null,171,43814.712499999994,null,null,171,3482.9594999999999,null,null,null,null,170,40331.752999999997,null,171,13481.449999999999]
[null,null,172,43814.712499999994,null,null,172,3482.9594999999999,null,null,null,null,171,40331.752999999997,null,172,13481.449999999999]
[null,null,173,43814.712499999994,null,null,173,3482.9594999999999,null,null,null,null,172,40331.752999999997,null,173,13481.449999999999]
[null,null,174,43814.712499999994,null,null,174,3482.9594999999999,null,null,null,null,173,40331.752999999997,null,174,13481.449999999999]
[null,null,175,43814.712499999994,null,null,175,3482.9594999999999,null,null,null,null,174,40331.752999999997,null,175,13481.449999999999]
[null,null,176,43814.712499999994,null,null,176,3482.9594999999999,null,null,null,null,175,40331.752999999997,null,176,13481.449999999999]
[null,null,177,43814.712499999994,null,null,177,3482.9594999999999,null,null,null,null,176,40331.752999999997,null,177,13481.449999999999]
[null,null,178,43814.712499999994,null,null,178,3482.9594999999999,null,null,null,null,177,40331.752999999997,null,178,13481.449999999999]
[null,null,179,43814.712499999994,null,null,179,3482.9594999999999,null,null,null,null,178,40331.752999999997,null,179,13481.449999999999]
[null,null,180,43814.712499999994,null,null,180,3482.9594999999999,null,null,null,null,179,40331.752999999997,null,180,13481.449999999999]
[null,null,181,43814.712499999994,null,null,181,3482.9594999999999,null,null,null,null,180,40331.752999999997,null,181,13481.449999999999]
[null,null,182,43814.712499999994,null,null,182,3482.9594999999999,null,null,null,null,181,40331.752999999997,null,182,13481.449999999999]
[null,null,183,43814.712499999994,null,null,183,3482.9594999999999,null,null,null,null,182,40331.752999999997,null,183,13481.449999999999]
[null,null,184,43814.712499999994,null,null,184,3482.9594999999999,null,null,null,null,183,40331.752999999997,null,184,13481.449999999999]
[null,null,185,43814.712499999994,null,null,185,3482.9594999999999,null,null,null,null,184,40331.752999999997,null,185,13481.449999999999]
[null,null,186,43814.712499999994,null,null,186,3482.9594999999999,null,null,null,null,185,40331.752999999997,null,186,13481.449999999999]
[null,null,187,43814.712499999994,null,null,187,3482.9594999999999,null,null,null,null,186,40331.752999999997,null,187,13481.449999999999]
[null,null,188,43814.712499999994,null,null,188,3482.9594999999999,null,null,null,null,187,40331.752999999997,null,188,13481.449999999999]
[null,null,189,43814.712499999994,null,null,189,3482.9594999999999,null,null,null,null,188,40331.752999999997,null,189,13481.449999999999]
[null,null,190,43814.712499999994,null,null,190,3482.9594999999999,null,null,null,null,189,40331.752999999997,null,190,13481.449999999999]
[null,null,191,43814.712499999994,null,null,191,3482.9594999999999,null,null,null,null,190,40331.752999999997,null,191,13481.449999999999]
[null,null,192,43814.712499999994,null,null,192,3482.9594999999999,null,null,null,null,191,40331.752999999997,null,192,13481.449999999999]
[null,null,193,43814.712499999994,null,null,193,3482.9594999999999,null,null,null,null,192,40331.752999999997,null,193,13481.449999999999]
[null,null,194,43814.712499999994,null,null,194,3482.9594999999999,null,null,null,null,193,40331.752999999997,null,194,13481.449999999999]
[null,null,195,43814.712499999994,null,null,195,3482.9594999999999,null,null,null,null,194,40331.752999999997,null,195,13481.449999999999]
[null,null,196,43814.712499999994,null,null,196,3482.9594999999999,null,null,null,null,195,40331.752999999997,null,196,13481.449999999999]
[null,null,197,43814.712499999994,null,null,197,3482.9594999999999,null,null,null,null,196,40331.752999999997,null,197,13481.449999999999]
[null,null,198,43814.712499999994,null,null,198,3482.9594999999999,null,null,null,null,197,40331.752999999997,null,198,13481.449999999999]
[null,null,199,43814.712499999994,null,null,199,3482.9594999999999,null,null,null,null,198,40331.752999999997,null,199,13481.449999999999]
[null,null,200,43814.712499999994,null,null,200,3482.9594999999999,null,null,null,null,199,40331.752999999997,null,200,13481.449999999999]
[null,null,201,43814.712499999994,null,null,201,3482.9594999999999,null,null,null,null,200,40331.752999999997,null,201,13481.449999999999]
[null,null,202,43814.712499999994,null,null,202,3482.9594999999999,null,null,null,null,201,40331.752999999997,null,202,13481.449999999999]
[null,null,203,43814.712499999994,null,null,203,3482.9594999999999,null,null,null,null,202,40331.752999999997,null,203,13481.449999999999]
[null,null,204,43814.712499999994,null,null,204,3482.9594999999999,null,null,null,null,203,40331.752999999997,null,204,13481.449999999999]
[null,null,205,43814.712499999994,null,null,205,3482.9594999999999,null,null,null,null,204,40331.752999999997,null,205,13481.449999999999]
[null,null,206,43814.712499999994,null,null,206,3482.9594999999999,null,null,null,null,205,40331.752999999997,null,206,13481.449999999999]
[null,null,207,43814.712499999994,null,null,207,3482.9594999999999,null,null,null,null,206,40331.752999999997,null,207,13481.449999999999]
[null,null,208,43814.712499999994,null,null,208,3482.9594999999999,null,null,null,null,207,40331.752999999997,null,208,13481.449999999999]
[null,null,209,43814.712499999994,null,null,209,3482.9594999999999,null,null,null,null,208,40331.752999999997,null,209,13481.449999999999]
[null,null,210,43814.712499999994,null,null,210,3482.9594999999999,null,null,null,null,209,40331.752999999997,null,210,13481.449999999999]
[null,null,211,43814.712499999994,null,null,211,3482.9594999999999,null,null,null,null,210,40331.752999999997,null,211,13481.449999999999]
[null,null,212,43814.712499999994,null,null,212,3482.9594999999999,null,null,null,null,211,40331.752999999997,null,212,13481.449999999999]
[null,null,213,43814.712499999994,null,null,213,3482.9594999999999,null,null,null,null,212,40331.752999999997,null,213,13481.449999999999]
[null,null,214,43814.712499999994,null,null,214,3482.9594999999999,null,null,null,null,213,40331.752999999997,null,214,13481.449999999999]
[null,null,215,43814.712499999994,null,null,215,3482.9594999999999,null,null,null,null,214,40331.752999999997,null,215,13481.449999999999]
[null,null,216,43814.712499999994,null,null,216,3482.9594999999999,null,null,null,null,215,40331.752999999997,null,216,13481.449999999999]
[null,null,217,43814.712499999994,null,null,217,3482.9594999999999,null,null,null,null,216,40331.752999999997,null,217,13481.449999999999]
[null,null,218,43814.712499999994,null,null,218,3482.9594999999999,null,null,null,null,217,40331.752999999997,null,218,13481.449999999999]
[null,null,219,43814.712499999994,null,null,219,3482.9594999999999,null,null,null,null,218,40331.752999999997,null,219,13481.449999999999]
[null,null,220,43814.712499999994,null,null,220,3482.9594999999999,null,null,null,null,219,40331.752999999997,null,220,13481.449999999999]
[null,null,221,43814.712499999994,null,null,221,3482.9594999999999,null,null,null,null,220,40331.752999999997,null,221,13481.449999999999]
[null,null,222,43814.712499999994,null,null,222,3482.9594999999999,null,null,null,null,221,40331.752999999997,null,222,13481.449999999999]
[null,null,223,43814.712499999994,null,null,223,3482.9594999999999,null,null,null,null,222,40331.752999999997,null,223,13481.449999999999]
[null,null,224,43814.712499999994,null,null,224,3482.9594999999999,null,null,null,null,223,40331.752999999997,null,224,13481.449999999999]
[null,null,225,43814.712499999994,null,null,225,3482.9594999999999,null,null,null,null,224,40331.752999999997,null,225,13481.449999999999]
[null,null,226,43814.712499999994,null,null,226,3482.9594999999999,null,null,null,null,225,40331.752999999997,null,226,13481.449999999999]
[null,null,227,43814.712499999994,null,null,227,3482.9594999999999,null,null,null,null,226,40331.752999999997,null,227,13481.449999999999]
[null,null,228,43814.712499999994,null,null,228,3482.9594999999999,null,null,null,null,227,40331.752999999997,null,228,13481.449999999999]
[null,null,229,43814.712499999994,null,null,229,3482.9594999999999,null,null,null,null,228,40331.752999999997,null,229,13481.449999999999]
[null,null,230,43814.712499999994,null,null,230,3482.9594999999999,null,null,null,null,229,40331.752999999997,null,230,13481.449999999999]
[null,null,231,43814.712499999994,null,null,231,3482.9594999999999,null,null,null,null,230,40331.752999999997,null,231,13481.449999999999]
[null,null,232,43814.712499999994,null,null,232,3482.9594999999999,null,null,null,null,231,40331.752999999997,null,232,13481.449999999999]
[null,null,233,43814.712499999994,null,null,233,3482.9594999999999,null,null,null,null,232,40331.752999999997,null,233,13481.449999999999]
[null,null,234,43814.712499999994,null,null,234,3482.9594999999999,null,null,null,null,233,40331.752999999997,null,234,13481.449999999999]
[null,null,235,43814.712499999994,null,null,235,3482.9594999999999,null,null,null,null,234,40331.752999999997,null,235,13481.449999999999]
[null,null,236,43814.712499999994,null,null,236,3482.9594999999999,null,null,null,null,235,40331.752999999997,null,236,13481.449999999999]
[null,null,237,43814.712499999994,null,null,237,3482.9594999999999,null,null,null,null,236,40331.752999999997,null,237,13481.449999999999]
[null,null,238,43814.712499999994,null,null,238,3482.9594999999999,null,null,null,null,237,40331.752999999997,null,238,13481.449999999999]
[null,null,239,43814.712499999994,null,null,239,3482.9594999999999,null,null,null,null,238,40331.752999999997,null,239,13481.449999999999]
[null,null,240,43814.712499999994,null,null,240,3482.9594999999999,null,null,null,null,239,40331.752999999997,null,240,13481.449999999999]
[null,null,241,43814.712499999994,null,null,241,3482.9594999999999,null,null,null,null,240,40331.752999999997,null,241,13481.449999999999]
[null,null,242,43814.712499999994,null,null,242,3482.9594999999999,null,null,null,null,241,40331.752999999997,null,242,13481.449999999999]
[null,null,243,43814.712499999994,null,null,243,3482.9594999999999,null,null,null,null,242,40331.752999999997,null,243,13481.449999999999]
[null,null,244,43814.712499999994,null,null,244,3482.9594999999999,null,null,null,null,243,40331.752999999997,null,244,13481.449999999999]
[null,null,245,43814.712499999994,null,null,245,3482.9594999999999,null,null,null,null,244,40331.752999999997,null,245,13481.449999999999]
[null,null,246,43814.712499999994,null,null,246,3482.9594999999999,null,null,null,null,245,40331.752999999997,null,246,13481.449999999999]
[null,null,247,43814.712499999994,null,null,247,3482.9594999999999,null,null,null,null,246,40331.752999999997,null,247,13481.449999999999]
[null,null,248,43814.712499999994,null,null,248,3482.9594999999999,null,null,null,null,247,40331.752999999997,null,248,13481.449999999999]
[null,null,249,43814.712499999994,null,null,249,3482.9594999999999,null,null,null,null,248,40331.752999999997,null,249,13481.449999999999]
[null,null,250,43814.712499999994,null,null,250,3482.9594999999999,null,null,null,null,249,40331.752999999997,null,250,13481.449999999999]
[null,null,251,43814.712499999994,null,null,251,3482.9594999999999,null,null,null,null,250,40331.752999999997,null,251,13481.449999999999]
[null,null,252,43814.712499999994,null,null,252,3482.9594999999999,null,null,null,null,251,40331.752999999997,null,252,13481.449999999999]
[null,null,253,43814.712499999994,null,null,253,3482.9594999999999,null,null,null,null,252,40331.752999999997,null,253,13481.449999999999]
[null,null,254,43814.712499999994,null,null,254,3482.9594999999999,null,null,null,null,253,40331.752999999997,null,254,13481.449999999999]
[null,null,255,43814.712499999994,null,null,255,3482.9594999999999,null,null,null,null,254,40331.752999999997,null,255,13481.449999999999]
[null,null,256,43814.712499999994,null,null,256,3482.9594999999999,null,null,null,null,255,40331.752999999997,null,256,13481.449999999999]
[null,null,257,43814.712499999994,null,null,257,3482.9594999999999,null,null,null,null,256,40331.752999999997,null,257,13481.449999999999]
[null,null,258,43814.712499999994,null,null,258,3482.9594999999999,null,null,null,null,257,40331.752999999997,null,258,13481.449999999999]
[null,null,259,43814.712499999994,null,null,259,3482.9594999999999,null,null,null,null,258,40331.752999999997,null,259,13481.449999999999]
[null,null,260,43814.712499999994,null,null,260,3482.9594999999999,null,null,null,null,259,40331.752999999997,null,260,13481.449999999999]
[null,null,261,43814.712499999994,null,null,261,3482.9594999999999,null,null,null,null,260,40331.752999999997,null,261,13481.449999999999]
[null,null,262,43814.712499999994,null,null,262,3482.9594999999999,null,null,null,null,261,40331.752999999997,null,262,13481.449999999999]
[null,null,263,43814.712499999994,null,null,263,3482.9594999999999,null,null,null,null,262,40331.752999999997,null,263,13481.449999999999]
[null,null,264,43814.712499999994,null,null,264,3482.9594999999999,null,null,null,null,263,40331.752999999997,null,264,13481.449999999999]
[null,null,265,43814.712499999994,null,null,265,3482.9594999999999,null,null,null,null,264,40331.752999999997,null,265,13481.449999999999]
[null,null,266,43814.712499999994,null,null,266,3482.9594999999999,null,null,null,null,265,40331.752999999997,null,266,13481.449999999999]
[null,null,267,43814.712499999994,null,null,267,3482.9594999999999,null,null,null,null,266,40331.752999999997,null,267,13481.449999999999]
[null,null,268,43814.712499999994,null,null,268,3482.9594999999999,null,null,null,null,267,40331.752999999997,null,268,13481.449999999999]
[null,null,269,43814.712499999994,null,null,269,3482.9594999999999,null,null,null,null,268,40331.752999999997,null,269,13481.449999999999]
[null,null,270,43814.712499999994,null,null,270,3482.9594999999999,null,null,null,null,269,40331.752999999997,null,270,13481.449999999999]
[null,null,271,43814.712499999994,null,null,271,3482.9594999999999,null,null,null,null,270,40331.752999999997,null,271,13481.449999999999]
[null,null,272,43814.712499999994,null,null,272,3482.9594999999999,null,null,null,null,271,40331.752999999997,null,272,13481.449999999999]
[null,null,273,43814.712499999994,null,null,273,3482.9594999999999,null,null,null,null,272,40331.752999999997,null,273,13481.449999999999]
[null,null,274,43814.712499999994,null,null,274,3482.9594999999999,null,null,null,null,273,40331.752999999997,null,274,13481.449999999999]
[null,null,275,43814.712499999994,null,null,275,3482.9594999999999,null,null,null,null,274,40331.752999999997,null,275,13481.449999999999]
[null,null,276,43814.712499999994,null,null,276,3482.9594999999999,null,null,null,null,275,40331.752999999997,null,276,13481.449999999999]
[null,null,277,43814.712499999994,null,null,277,3482.9594999999999,null,null,null,null,276,40331.752999999997,null,277,13481.449999999999]
[null,null,278,43814.712499999994,null,null,278,3482.9594999999999,null,null,null,null,277,40331.752999999997,null,278,13481.449999999999]
[null,null,279,43814.712499999994,null,null,279,3482.9594999999999,null,null,null,null,278,40331.752999999997,null,279,13481.449999999999]
[null,null,280,43814.712499999994,null,null,280,3482.9594999999999,null,null,null,null,279,40331.752999999997,null,280,13481.449999999999]
[null,null,281,43814.712499999994,null,null,281,3482.9594999999999,null,null,null,null,280,40331.752999999997,null,281,13481.449999999999]
[null,null,282,43814.712499999994,null,null,282,3482.9594999999999,null,null,null,null,281,40331.752999999997,null,282,13481.449999999999]
[null,null,283,43814.712499999994,null,null,283,3482.9594999999999,null,null,null,null,282,40331.752999999997,null,283,13481.449999999999]
[null,null,284,43814.712499999994,null,null,284,3482.9594999999999,null,null,null,null,283,40331.752999999997,null,284,13481.449999999999]
[null,null,285,43814.712499999994,null,null,285,3482.9594999999999,null,null,null,null,284,40331.752999999997,null,285,13481.449999999999]
[null,null,286,43814.712499999994,null,null,286,3482.9594999999999,null,null,null,null,285,40331.752999999997,null,286,13481.449999999999]
[null,null,287,43814.712499999994,null,null,287,3482.9594999999999,null,null,null,null,286,40331.752999999997,null,287,13481.449999999999]
[null,null,288,43814.712499999994,null,null,288,3482.9594999999999,null,null,null,null,287,40331.752999999997,null,288,13481.449999999999]
[null,null,289,43814.712499999994,null,null,289,3482.9594999999999,null,null,null,null,288,40331.752999999997,null,289,13481.449999999999]
[null,null,290,43814.712499999994,null,null,290,3482.9594999999999,null,null,null,null,289,40331.752999999997,null,290,13481.449999999999]
[null,null,291,43814.712499999994,null,null,291,3482.9594999999999,null,null,null,null,290,40331.752999999997,null,291,13481.449999999999]
[null,null,292,43814.712499999994,null,null,292,3482.9594999999999,null,null,null,null,291,40331.752999999997,null,292,13481.449999999999]
[null,null,293,43814.712499999994,null,null,293,3482.9594999999999,null,null,null,null,292,40331.752999999997,null,293,13481.449999999999]
[null,null,294,43814.712499999994,null,null,294,3482.9594999999999,null,null,null,null,293,40331.752999999997,null,294,13481.449999999999]
[null,null,295,43814.712499999994,null,null,295,3482.9594999999999,null,null,null,null,294,40331.752999999997,null,295,13481.449999999999]
[null,null,296,43814.712499999994,null,null,296,3482.9594999999999,null,null,null,null,295,40331.752999999997,null,296,13481.449999999999]
[null,null,297,43814.712499999994,null,null,297,3482.9594999999999,null,null,null,null,296,40331.752999999997,null,297,13481.449999999999]
[null,null,298,43814.712499999994,null,null,298,3482.9594999999999,null,null,null,null,297,40331.752999999997,null,298,13481.449999999999]
[null,null,299,43814.712499999994,null,null,299,3482.9594999999999,null,null,null,null,298,40331.752999999997,null,299,13481.449999999999]
[null,null,300,43814.712499999994,null,null,300,3482.9594999999999,null,null,null,null,299,40331.752999999997,null,300,13481.449999999999]
[null,null,301,43814.712499999994,null,null,301,3482.9594999999999,null,null,null,null,300,40331.752999999997,null,301,13481.449999999999]
[null,null,302,43814.712499999994,null,null,302,3482.9594999999999,null,null,null,null,301,40331.752999999997,null,302,13481.449999999999]
[null,null,303,43814.712499999994,null,null,303,3482.9594999999999,null,null,null,null,302,40331.752999999997,null,303,13481.449999999999]
[null,null,304,43814.712499999994,null,null,304,3482.9594999999999,null,null,null,null,303,40331.752999999997,null,304,13481.449999999999]
[null,null,305,43814.712499999994,null,null,305,3482.9594999999999,null,null,null,null,304,40331.752999999997,null,305,13481.449999999999]
[null,null,306,43814.712499999994,null,null,306,3482.9594999999999,null,null,null,null,305,40331.752999999997,null,306,13481.449999999999]
[null,null,307,43814.712499999994,null,null,307,3482.9594999999999,null,null,null,null,306,40331.752999999997,null,307,13481.449999999999]
[null,null,308,43814.712499999994,null,null,308,3482.9594999999999,null,null,null,null,307,40331.752999999997,null,308,13481.449999999999]
[null,null,309,43814.712499999994,null,null,309,3482.9594999999999,null,null,null,null,308,40331.752999999997,null,309,13481.449999999999]
[null,null,310,43814.712499999994,null,null,310,3482.9594999999999,null,null,null,null,309,40331.752999999997,null,310,13481.449999999999]
[null,null,311,43814.712499999994,null,null,311,3482.9594999999999,null,null,null,null,310,40331.752999999997,null,311,13481.449999999999]
[null,null,312,43814.712499999994,null,null,312,3482.9594999999999,null,null,null,null,311,40331.752999999997,null,312,13481.449999999999]
[null,null,313,43814.712499999994,null,null,313,3482.9594999999999,null,null,null,null,312,40331.752999999997,null,313,13481.449999999999]
[null,null,314,43814.712499999994,null,null,314,3482.9594999999999,null,null,null,null,313,40331.752999999997,null,314,13481.449999999999]
[null,null,315,43814.712499999994,null,null,315,3482.9594999999999,null,null,null,null,314,40331.752999999997,null,315,13481.449999999999]
[null,null,316,43814.712499999994,null,null,316,3482.9594999999999,null,null,null,null,315,40331.752999999997,null,316,13481.449999999999]
[null,null,317,43814.712499999994,null,null,317,3482.9594999999999,null,null,null,null,316,40331.752999999997,null,317,13481.449999999999]
[null,null,318,43814.712499999994,null,null,318,3482.9594999999999,null,null,null,null,317,40331.752999999997,null,318,13481.449999999999]
[null,null,319,43814.712499999994,null,null,319,3482.9594999999999,null,null,null,null,318,40331.752999999997,null,319,13481.449999999999]
[null,null,320,43814.712499999994,null,null,320,3482.9594999999999,null,null,null,null,319,40331.752999999997,null,320,13481.449999999999]
[null,null,321,43814.712499999994,null,null,321,3482.9594999999999,null,null,null,null,320,40331.752999999997,null,321,13481.449999999999]
[null,null,322,43814.712499999994,null,null,322,3482.9594999999999,null,null,null,null,321,40331.752999999997,null,322,13481.449999999999]
[null,null,323,43814.712499999994,null,null,323,3482.9594999999999,null,null,null,null,322,40331.752999999997,null,323,13481.449999999999]
[null,null,324,43814.712499999994,null,null,324,3482.9594999999999,null,null,null,null,323,40331.752999999997,null,324,13481.449999999999]
[null,null,325,43814.712499999994,null,null,325,3482.9594999999999,null,null,null,null,324,40331.752999999997,null,325,13481.449999999999]
[null,null,326,43814.712499999994,null,null,326,3482.9594999999999,null,null,null,null,325,40331.752999999997,null,326,13481.449999999999]
[null,null,327,43814.712499999994,null,null,327,3482.9594999999999,null,null,null,null,326,40331.752999999997,null,327,13481.449999999999]
[null,null,328,43814.712499999994,null,null,328,3482.9594999999999,null,null,null,null,327,40331.752999999997,null,328,13481.449999999999]
[null,null,329,43814.712499999994,null,null,329,3482.9594999999999,null,null,null,null,328,40331.752999999997,null,329,13481.449999999999]
[null,null,330,43814.712499999994,null,null,330,3482.9594999999999,null,null,null,null,329,40331.752999999997,null,330,13481.449999999999]
[null,null,331,43814.712499999994,null,null,331,3482.9594999999999,null,null,null,null,330,40331.752999999997,null,331,13481.449999999999]
[null,null,332,43814.712499999994,null,null,332,3482.9594999999999,null,null,null,null,331,40331.752999999997,null,332,13481.449999999999]
[null,null,333,43814.712499999994,null,null,333,3482.9594999999999,null,null,null,null,332,40331.752999999997,null,333,13481.449999999999]
[null,null,334,43814.712499999994,null,null,334,3482.9594999999999,null,null,null,null,333,40331.752999999997,null,334,13481.449999999999]
[null,null,335,43814.712499999994,null,null,335,3482.9594999999999,null,null,null,null,334,40331.752999999997,null,335,13481.449999999999]
[null,null,336,43814.712499999994,null,null,336,3482.9594999999999,null,null,null,null,335,40331.752999999997,null,336,13481.449999999999]
[null,null,337,43814.712499999994,null,null,337,3482.9594999999999,null,null,null,null,336,40331.752999999997,null,337,13481.449999999999]
[null,null,338,43814.712499999994,null,null,338,3482.9594999999999,null,null,null,null,337,40331.752999999997,null,338,13481.449999999999]
[null,null,339,43814.712499999994,null,null,339,3482.9594999999999,null,null,null,null,338,40331.752999999997,null,339,13481.449999999999]
[null,null,340,43814.712499999994,null,null,340,3482.9594999999999,null,null,null,null,339,40331.752999999997,null,340,13481.449999999999]
[null,null,341,43814.712499999994,null,null,341,3482.9594999999999,null,null,null,null,340,40331.752999999997,null,341,13481.449999999999]
[null,null,342,43814.712499999994,null,null,342,3482.9594999999999,null,null,null,null,341,40331.752999999997,null,342,13481.449999999999]
[null,null,343,43814.712499999994,null,null,343,3482.9594999999999,null,null,null,null,342,40331.752999999997,null,343,13481.449999999999]
[null,null,344,43814.712499999994,null,null,344,3482.9594999999999,null,null,null,null,343,40331.752999999997,null,344,13481.449999999999]
[null,null,345,43814.712499999994,null,null,345,3482.9594999999999,null,null,null,null,344,40331.752999999997,null,345,13481.449999999999]
[null,null,346,43814.712499999994,null,null,346,3482.9594999999999,null,null,null,null,345,40331.752999999997,null,346,13481.449999999999]
[null,null,347,43814.712499999994,null,null,347,3482.9594999999999,null,null,null,null,346,40331.752999999997,null,347,13481.449999999999]
[null,null,348,43814.712499999994,null,null,348,3482.9594999999999,null,null,null,null,347,40331.752999999997,null,348,13481.449999999999]
[null,null,349,43814.712499999994,null,null,349,3482.9594999999999,null,null,null,null,348,40331.752999999997,null,349,13481.449999999999]
[null,null,350,43814.712499999994,null,null,350,3482.9594999999999,null,null,null,null,349,40331.752999999997,null,350,13481.449999999999]
[null,null,351,43814.712499999994,null,null,351,3482.9594999999999,null,null,null,null,350,40331.752999999997,null,351,13481.449999999999]
[null,null,352,43814.712499999994,null,null,352,3482.9594999999999,null,null,null,null,351,40331.752999999997,null,352,13481.449999999999]
[null,null,353,43814.712499999994,null,null,353,3482.9594999999999,null,null,null,null,352,40331.752999999997,null,353,13481.449999999999]
[null,null,354,43814.712499999994,null,null,354,3482.9594999999999,null,null,null,null,353,40331.752999999997,null,354,13481.449999999999]
[null,null,355,43814.712499999994,null,null,355,3482.9594999999999,null,null,null,null,354,40331.752999999997,null,355,13481.449999999999]
[null,null,356,43814.712499999994,null,null,356,3482.9594999999999,null,null,null,null,355,40331.752999999997,null,356,13481.449999999999]
[null,null,357,43814.712499999994,null,null,357,3482.9594999999999,null,null,null,null,356,40331.752999999997,null,357,13481.449999999999]
[null,null,358,43814.712499999994,null,null,358,3482.9594999999999,null,null,null,null,357,40331.752999999997,null,358,13481.449999999999]
[null,null,359,43814.712499999994,null,null,359,3482.9594999999999,null,null,null,null,358,40331.752999999997,null,359,13481.449999999999]
[null,null,360,43814.712499999994,null,null,360,3482.9594999999999,null,null,null,null,359,40331.752999999997,null,360,13481.449999999999]
[null,null,361,43814.712499999994,null,null,361,3482.9594999999999,null,null,null,null,360,40331.752999999997,null,361,13481.449999999999]
[null,null,362,43814.712499999994,null,null,362,3482.9594999999999,null,null,null,null,361,40331.752999999997,null,362,13481.449999999999]
[null,null,363,43814.712499999994,null,null,363,3482.9594999999999,null,null,null,null,362,40331.752999999997,null,363,13481.449999999999]
[null,null,364,43814.712499999994,null,null,364,3482.9594999999999,null,null,null,null,363,40331.752999999997,null,364,13481.449999999999]
[null,null,365,43814.712499999994,null,null,365,3482.9594999999999,null,null,null,null,364,40331.752999999997,null,365,13481.449999999999]
[null,null,366,43814.712499999994,null,null,366,3482.9594999999999,null,null,null,null,365,40331.752999999997,null,366,13481.449999999999]
[null,null,367,43814.712499999994,null,null,367,3482.9594999999999,null,null,null,null,366,40331.752999999997,null,367,13481.449999999999]
[null,null,368,43814.712499999994,null,null,368,3482.9594999999999,null,null,null,null,367,40331.752999999997,null,368,13481.449999999999]
[null,null,369,43814.712499999994,null,null,369,3482.9594999999999,null,null,null,null,368,40331.752999999997,null,369,13481.449999999999]
[null,null,370,43814.712499999994,null,null,370,3482.9594999999999,null,null,null,null,369,40331.752999999997,null,370,13481.449999999999]
[null,null,371,43814.712499999994,null,null,371,3482.9594999999999,null,null,null,null,370,40331.752999999997,null,371,13481.449999999999]
[null,null,372,43814.712499999994,null,null,372,3482.9594999999999,null,null,null,null,371,40331.752999999997,null,372,13481.449999999999]
[null,null,373,43814.712499999994,null,null,373,3482.9594999999999,null,null,null,null,372,40331.752999999997,null,373,13481.449999999999]
[null,null,374,43814.712499999994,null,null,374,3482.9594999999999,null,null,null,null,373,40331.752999999997,null,374,13481.449999999999]
[null,null,375,43814.712499999994,null,null,375,3482.9594999999999,null,null,null,null,374,40331.752999999997,null,375,13481.449999999999]
[null,null,376,43814.712499999994,null,null,376,3482.9594999999999,null,null,null,null,375,40331.752999999997,null,376,13481.449999999999]
[null,null,377,43814.712499999994,null,null,377,3482.9594999999999,null,null,null,null,376,40331.752999999997,null,377,13481.449999999999]
[null,null,378,43814.712499999994,null,null,378,3482.9594999999999,null,null,null,null,377,40331.752999999997,null,378,13481.449999999999]
[null,null,379,43814.712499999994,null,null,379,3482.9594999999999,null,null,null,null,378,40331.752999999997,null,379,13481.449999999999]
[null,null,380,43814.712499999994,null,null,380,3482.9594999999999,null,null,null,null,379,40331.752999999997,null,380,13481.449999999999]
[null,null,381,43814.712499999994,null,null,381,3482.9594999999999,null,null,null,null,380,40331.752999999997,null,381,13481.449999999999]
[null,null,382,43814.712499999994,null,null,382,3482.9594999999999,null,null,null,null,381,40331.752999999997,null,382,13481.449999999999]
[null,null,383,43814.712499999994,null,null,383,3482.9594999999999,null,null,null,null,382,40331.752999999997,null,383,13481.449999999999]
[null,null,384,43814.712499999994,null,null,384,3482.9594999999999,null,null,null,null,383,40331.752999999997,null,384,13481.449999999999]
[null,null,385,43814.712499999994,null,null,385,3482.9594999999999,null,null,null,null,384,40331.752999999997,null,385,13481.449999999999]
[null,null,386,43814.712499999994,null,null,386,3482.9594999999999,null,null,null,null,385,40331.752999999997,null,386,13481.449999999999]
[null,null,387,43814.712499999994,null,null,387,3482.9594999999999,null,null,null,null,386,40331.752999999997,null,387,13481.449999999999]
[null,null,388,43814.712499999994,null,null,388,3482.9594999999999,null,null,null,null,387,40331.752999999997,null,388,13481.449999999999]
[null,null,389,43814.712499999994,null,null,389,3482.9594999999999,null,null,null,null,388,40331.752999999997,null,389,13481.449999999999]
[null,null,390,43814.712499999994,null,null,390,3482.9594999999999,null,null,null,null,389,40331.752999999997,null,390,13481.449999999999]
[null,null,391,43814.712499999994,null,null,391,3482.9594999999999,null,null,null,null,390,40331.752999999997,null,391,13481.449999999999]
[null,null,392,43814.712499999994,null,null,392,3482.9594999999999,null,null,null,null,391,40331.752999999997,null,392,13481.449999999999]
[null,null,393,43814.712499999994,null,null,393,3482.9594999999999,null,null,null,null,392,40331.752999999997,null,393,13481.449999999999]
[null,null,394,43814.712499999994,null,null,394,3482.9594999999999,null,null,null,null,393,40331.752999999997,null,394,13481.449999999999]
[null,null,395,43814.712499999994,null,null,395,3482.9594999999999,null,null,null,null,394,40331.752999999997,null,395,13481.449999999999]
[null,null,396,43814.712499999994,null,null,396,3482.9594999999999,null,null,null,null,395,40331.752999999997,null,396,13481.449999999999]
[null,null,397,43814.712499999994,null,null,397,3482.9594999999999,null,null,null,null,396,40331.752999999997,null,397,13481.449999999999]
[null,null,398,43814.712499999994,null,null,398,3482.9594999999999,null,null,null,null,397,40331.752999999997,null,398,13481.449999999999]
[null,null,399,43814.712499999994,null,null,399,3482.9594999999999,null,null,null,null,398,40331.752999999997,null,399,13481.449999999999]
[null,null,400,43814.712499999994,null,null,400,3482.9594999999999,null,null,null,null,399,40331.752999999997,null,400,13481.449999999999]
[null,null,401,43814.712499999994,null,null,401,3482.9594999999999,null,null,null,null,400,40331.752999999997,null,401,13481.449999999999]
[null,null,402,43814.712499999994,null,null,402,3482.9594999999999,null,null,null,null,401,40331.752999999997,null,402,13481.449999999999]
[null,null,403,43814.712499999994,null,null,403,3482.9594999999999,null,null,null,null,402,40331.752999999997,null,403,13481.449999999999]
[null,null,404,43814.712499999994,null,null,404,3482.9594999999999,null,null,null,null,403,40331.752999999997,null,404,13481.449999999999]
[null,null,405,43814.712499999994,null,null,405,3482.9594999999999,null,null,null,null,404,40331.752999999997,null,405,13481.449999999999]
[null,null,406,43814.712499999994,null,null,406,3482.9594999999999,null,null,null,null,405,40331.752999999997,null,406,13481.449999999999]
[null,null,407,43814.712499999994,null,null,407,3482.9594999999999,null,null,null,null,406,40331.752999999997,null,407,13481.449999999999]
[null,null,408,43814.712499999994,null,null,408,3482.9594999999999,null,null,null,null,407,40331.752999999997,null,408,13481.449999999999]
[null,null,409,43814.712499999994,null,null,409,3482.9594999999999,null,null,null,null,408,40331.752999999997,null,409,13481.449999999999]
[null,null,410,43814.712499999994,null,null,410,3482.9594999999999,null,null,null,null,409,40331.752999999997,null,410,13481.449999999999]
[null,null,411,43814.712499999994,null,null,411,3482.9594999999999,null,null,null,null,410,40331.752999999997,null,411,13481.449999999999]
[null,null,412,43814.712499999994,null,null,412,3482.9594999999999,null,null,null,null,411,40331.752999999997,null,412,13481.449999999999]
[null,null,413,43814.712499999994,null,null,413,3482.9594999999999,null,null,null,null,412,40331.752999999997,null,413,13481.449999999999]
[null,null,414,43814.712499999994,null,null,414,3482.9594999999999,null,null,null,null,413,40331.752999999997,null,414,13481.449999999999]
[null,null,415,43814.712499999994,null,null,415,3482.9594999999999,null,null,null,null,414,40331.752999999997,null,415,13481.449999999999]
[null,null,416,43814.712499999994,null,null,416,3482.9594999999999,null,null,null,null,415,40331.752999999997,null,416,13481.449999999999]
[null,null,417,43814.712499999994,null,null,417,3482.9594999999999,null,null,null,null,416,40331.752999999997,null,417,13481.449999999999]
[null,null,418,43814.712499999994,null,null,418,3482.9594999999999,null,null,null,null,417,40331.752999999997,null,418,13481.449999999999]
[null,null,419,43814.712499999994,null,null,419,3482.9594999999999,null,null,null,null,418,40331.752999999997,null,419,13481.449999999999]
[null,null,420,43814.712499999994,null,null,420,3482.9594999999999,null,null,null,null,419,40331.752999999997,null,420,13481.449999999999]
[null,null,421,43814.712499999994,null,null,421,3482.9594999999999,null,null,null,null,420,40331.752999999997,null,421,13481.449999999999]
[null,null,422,43814.712499999994,null,null,422,3482.9594999999999,null,null,null,null,421,40331.752999999997,null,422,13481.449999999999]
[null,null,423,43814.712499999994,null,null,423,3482.9594999999999,null,null,null,null,422,40331.752999999997,null,423,13481.449999999999]
[null,null,424,43814.712499999994,null,null,424,3482.9594999999999,null,null,null,null,423,40331.752999999997,null,424,13481.449999999999]
[null,null,425,43814.712499999994,null,null,425,3482.9594999999999,null,null,null,null,424,40331.752999999997,null,425,13481.449999999999]
[null,null,426,43814.712499999994,null,null,426,3482.9594999999999,null,null,null,null,425,40331.752999999997,null,426,13481.449999999999]
[null,null,427,43814.712499999994,null,null,427,3482.9594999999999,null,null,null,null,426,40331.752999999997,null,427,13481.449999999999]
[null,null,428,43814.712499999994,null,null,428,3482.9594999999999,null,null,null,null,427,40331.752999999997,null,428,13481.449999999999]
[null,null,429,43814.712499999994,null,null,429,3482.9594999999999,null,null,null,null,428,40331.752999999997,null,429,13481.449999999999]
[null,null,430,43814.712499999994,null,null,430,3482.9594999999999,null,null,null,null,429,40331.752999999997,null,430,13481.449999999999]
[null,null,431,43814.712499999994,null,null,431,3482.9594999999999,null,null,null,null,430,40331.752999999997,null,431,13481.449999999999]
[null,null,432,43814.712499999994,null,null,432,3482.9594999999999,null,null,null,null,431,40331.752999999997,null,432,13481.449999999999]
[null,null,433,43814.712499999994,null,null,433,3482.9594999999999,null,null,null,null,432,40331.752999999997,null,433,13481.449999999999]
[null,null,434,43814.712499999994,null,null,434,3482.9594999999999,null,null,null,null,433,40331.752999999997,null,434,13481.449999999999]
[null,null,435,43814.712499999994,null,null,435,3482.9594999999999,null,null,null,null,434,40331.752999999997,null,435,13481.449999999999]
[null,null,436,43814.712499999994,null,null,436,3482.9594999999999,null,null,null,null,435,40331.752999999997,null,436,13481.449999999999]
[null,null,437,43814.712499999994,null,null,437,3482.9594999999999,null,null,null,null,436,40331.752999999997,null,437,13481.449999999999]
[null,null,438,43814.712499999994,null,null,438,3482.9594999999999,null,null,null,null,437,40331.752999999997,null,438,13481.449999999999]
[null,null,439,43814.712499999994,null,null,439,3482.9594999999999,null,null,null,null,438,40331.752999999997,null,439,13481.449999999999]
[null,null,440,43814.712499999994,null,null,440,3482.9594999999999,null,null,null,null,439,40331.752999999997,null,440,13481.449999999999]
[null,null,441,43814.712499999994,null,null,441,3482.9594999999999,null,null,null,null,440,40331.752999999997,null,441,13481.449999999999]
[null,null,442,43814.712499999994,null,null,442,3482.9594999999999,null,null,null,null,441,40331.752999999997,null,442,13481.449999999999]
[null,null,443,43814.712499999994,null,null,443,3482.9594999999999,null,null,null,null,442,40331.752999999997,null,443,13481.449999999999]
[null,null,444,43814.712499999994,null,null,444,3482.9594999999999,null,null,null,null,443,40331.752999999997,null,444,13481.449999999999]
[null,null,445,43814.712499999994,null,null,445,3482.9594999999999,null,null,null,null,444,40331.752999999997,null,445,13481.449999999999]
[null,null,446,43814.712499999994,null,null,446,3482.9594999999999,null,null,null,null,445,40331.752999999997,null,446,13481.449999999999]
[null,null,447,43814.712499999994,null,null,447,3482.9594999999999,null,null,null,null,446,40331.752999999997,null,447,13481.449999999999]
[null,null,448,43814.712499999994,null,null,448,3482.9594999999999,null,null,null,null,447,40331.752999999997,null,448,13481.449999999999]
[null,null,449,43814.712499999994,null,null,449,3482.9594999999999,null,null,null,null,448,40331.752999999997,null,449,13481.449999999999]
[null,null,450,43814.712499999994,null,null,450,3482.9594999999999,null,null,null,null,449,40331.752999999997,null,450,13481.449999999999]
[null,null,451,43814.712499999994,null,null,451,3482.9594999999999,null,null,null,null,450,40331.752999999997,null,451,13481.449999999999]
[null,null,452,43814.712499999994,null,null,452,3482.9594999999999,null,null,null,null,451,40331.752999999997,null,452,13481.449999999999]
[null,null,453,43814.712499999994,null,null,453,3482.9594999999999,null,null,null,null,452,40331.752999999997,null,453,13481.449999999999]
[null,null,454,43814.712499999994,null,null,454,3482.9594999999999,null,null,null,null,453,40331.752999999997,null,454,13481.449999999999]
[null,null,455,43814.712499999994,null,null,455,3482.9594999999999,null,null,null,null,454,40331.752999999997,null,455,13481.449999999999]
[null,null,456,43814.712499999994,null,null,456,3482.9594999999999,null,null,null,null,455,40331.752999999997,null,456,13481.449999999999]
[null,null,457,43814.712499999994,null,null,457,3482.9594999999999,null,null,null,null,456,40331.752999999997,null,457,13481.449999999999]
[null,null,458,43814.712499999994,null,null,458,3482.9594999999999,null,null,null,null,457,40331.752999999997,null,458,13481.449999999999]
[null,null,459,43814.712499999994,null,null,459,3482.9594999999999,null,null,null,null,458,40331.752999999997,null,459,13481.449999999999]
[null,null,460,43814.712499999994,null,null,460,3482.9594999999999,null,null,null,null,459,40331.752999999997,null,460,13481.449999999999]
[null,null,461,43814.712499999994,null,null,461,3482.9594999999999,null,null,null,null,460,40331.752999999997,null,461,13481.449999999999]
[null,null,462,43814.712499999994,null,null,462,3482.9594999999999,null,null,null,null,461,40331.752999999997,null,462,13481.449999999999]
[null,null,463,43814.712499999994,null,null,463,3482.9594999999999,null,null,null,null,462,40331.752999999997,null,463,13481.449999999999]
[null,null,464,43814.712499999994,null,null,464,3482.9594999999999,null,null,null,null,463,40331.752999999997,null,464,13481.449999999999]
[null,null,465,43814.712499999994,null,null,465,3482.9594999999999,null,null,null,null,464,40331.752999999997,null,465,13481.449999999999]
[null,null,466,43814.712499999994,null,null,466,3482.9594999999999,null,null,null,null,465,40331.752999999997,null,466,13481.449999999999]
[null,null,467,43814.712499999994,null,null,467,3482.9594999999999,null,null,null,null,466,40331.752999999997,null,467,13481.449999999999]
[null,null,468,43814.712499999994,null,null,468,3482.9594999999999,null,null,null,null,467,40331.752999999997,null,468,13481.449999999999]
[null,null,469,43814.712499999994,null,null,469,3482.9594999999999,null,null,null,null,468,40331.752999999997,null,469,13481.449999999999]
[null,null,470,43814.712499999994,null,null,470,3482.9594999999999,null,null,null,null,469,40331.752999999997,null,470,13481.449999999999]
[null,null,471,43814.712499999994,null,null,471,3482.9594999999999,null,null,null,null,470,40331.752999999997,null,471,13481.449999999999]
[null,null,472,43814.712499999994,null,null,472,3482.9594999999999,null,null,null,null,471,40331.752999999997,null,472,13481.449999999999]
[null,null,473,43814.712499999994,null,null,473,3482.9594999999999,null,null,null,null,472,40331.752999999997,null,473,13481.449999999999]
[null,null,474,43814.712499999994,null,null,474,3482.9594999999999,null,null,null,null,473,40331.752999999997,null,474,13481.449999999999]
[null,null,475,43814.712499999994,null,null,475,3482.9594999999999,null,null,null,null,474,40331.752999999997,null,475,13481.449999999999]
[null,null,476,43814.712499999994,null,null,476,3482.9594999999999,null,null,null,null,475,40331.752999999997,null,476,13481.449999999999]
[null,null,477,43814.712499999994,null,null,477,3482.9594999999999,null,null,null,null,476,40331.752999999997,null,477,13481.449999999999]
[null,null,478,43814.712499999994,null,null,478,3482.9594999999999,null,null,null,null,477,40331.752999999997,null,478,13481.449999999999]
[null,null,479,43814.712499999994,null,null,479,3482.9594999999999,null,null,null,null,478,40331.752999999997,null,479,13481.449999999999]
[null,null,480,43814.712499999994,null,null,480,3482.9594999999999,null,null,null,null,479,40331.752999999997,null,480,13481.449999999999]
[null,null,481,43814.712499999994,null,null,481,3482.9594999999999,null,null,null,null,480,40331.752999999997,null,481,13481.449999999999]
[null,null,482,43814.712499999994,null,null,482,3482.9594999999999,null,null,null,null,481,40331.752999999997,null,482,13481.449999999999]
[null,null,483,43814.712499999994,null,null,483,3482.9594999999999,null,null,null,null,482,40331.752999999997,null,483,13481.449999999999]
[null,null,484,43814.712499999994,null,null,484,3482.9594999999999,null,null,null,null,483,40331.752999999997,null,484,13481.449999999999]
[null,null,485,43814.712499999994,null,null,485,3482.9594999999999,null,null,null,null,484,40331.752999999997,null,485,13481.449999999999]
[null,null,486,43814.712499999994,null,null,486,3482.9594999999999,null,null,null,null,485,40331.752999999997,null,486,13481.449999999999]
[null,null,487,43814.712499999994,null,null,487,3482.9594999999999,null,null,null,null,486,40331.752999999997,null,487,13481.449999999999]
[null,null,488,43814.712499999994,null,null,488,3482.9594999999999,null,null,null,null,487,40331.752999999997,null,488,13481.449999999999]
[null,null,489,43814.712499999994,null,null,489,3482.9594999999999,null,null,null,null,488,40331.752999999997,null,489,13481.449999999999]
[null,null,490,43814.712499999994,null,null,490,3482.9594999999999,null,null,null,null,489,40331.752999999997,null,490,13481.449999999999]
[null,null,491,43814.712499999994,null,null,491,3482.9594999999999,null,null,null,null,490,40331.752999999997,null,491,13481.449999999999]
[null,null,492,43814.712499999994,null,null,492,3482.9594999999999,null,null,null,null,491,40331.752999999997,null,492,13481.449999999999]
[null,null,493,43814.712499999994,null,null,493,3482.9594999999999,null,null,null,null,492,40331.752999999997,null,493,13481.449999999999]
[null,null,494,43814.712499999994,null,null,494,3482.9594999999999,null,null,null,null,493,40331.752999999997,null,494,13481.449999999999]
[null,null,495,43814.712499999994,null,null,495,3482.9594999999999,null,null,null,null,494,40331.752999999997,null,495,13481.449999999999]
[null,null,496,43814.712499999994,null,null,496,3482.9594999999999,null,null,null,null,495,40331.752999999997,null,496,13481.449999999999]
[null,null,497,43814.712499999994,null,null,497,3482.9594999999999,null,null,null,null,496,40331.752999999997,null,497,13481.449999999999]
[null,null,498,43814.712499999994,null,null,498,3482.9594999999999,null,null,null,null,497,40331.752999999997,null,498,13481.449999999999]
[null,null,499,43814.712499999994,null,null,499,3482.9594999999999,null,null,null,null,498,40331.752999999997,null,499,13481.449999999999]
[null,null,500,43814.712499999994,null,null,500,3482.9594999999999,null,null,null,null,499,40331.752999999997,null,500,13481.449999999999]
[null,null,501,43814.712499999994,null,null,501,3482.9594999999999,null,null,null,null,500,40331.752999999997,null,501,13481.449999999999]
[null,null,502,43814.712499999994,null,null,502,3482.9594999999999,null,null,null,null,501,40331.752999999997,null,502,13481.449999999999]
[null,null,503,43814.712499999994,null,null,503,3482.9594999999999,null,null,null,null,502,40331.752999999997,null,503,13481.449999999999]
[null,null,504,43814.712499999994,null,null,504,3482.9594999999999,null,null,null,null,503,40331.752999999997,null,504,13481.449999999999]
[null,null,505,43814.712499999994,null,null,505,3482.9594999999999,null,null,null,null,504,40331.752999999997,null,505,13481.449999999999]
[null,null,506,43814.712499999994,null,null,506,3482.9594999999999,null,null,null,null,505,40331.752999999997,null,506,13481.449999999999]
[null,null,507,43814.712499999994,null,null,507,3482.9594999999999,null,null,null,null,506,40331.752999999997,null,507,13481.449999999999]
[null,null,508,43814.712499999994,null,null,508,3482.9594999999999,null,null,null,null,507,40331.752999999997,null,508,13481.449999999999]
[null,null,509,43814.712499999994,null,null,509,3482.9594999999999,null,null,null,null,508,40331.752999999997,null,509,13481.449999999999]
[null,null,510,43814.712499999994,null,null,510,3482.9594999999999,null,null,null,null,509,40331.752999999997,null,510,13481.449999999999]
[null,null,511,43814.712499999994,null,null,511,3482.9594999999999,null,null,null,null,510,40331.752999999997,null,511,13481.449999999999]
[null,null,512,43814.712499999994,null,null,512,3482.9594999999999,null,null,null,null,511,40331.752999999997,null,512,13481.449999999999]
[null,null,513,43814.712499999994,null,null,513,3482.9594999999999,null,null,null,null,512,40331.752999999997,null,513,13481.449999999999]
[null,null,514,43814.712499999994,null,null,514,3482.9594999999999,null,null,null,null,513,40331.752999999997,null,514,13481.449999999999]
[null,null,515,43814.712499999994,null,null,515,3482.9594999999999,null,null,null,null,514,40331.752999999997,null,515,13481.449999999999]
[null,null,516,43814.712499999994,null,null,516,3482.9594999999999,null,null,null,null,515,40331.752999999997,null,516,13481.449999999999]
[null,null,517,43814.712499999994,null,null,517,3482.9594999999999,null,null,null,null,516,40331.752999999997,null,517,13481.449999999999]
[null,null,518,43814.712499999994,null,null,518,3482.9594999999999,null,null,null,null,517,40331.752999999997,null,518,13481.449999999999]
[null,null,519,43814.712499999994,null,null,519,3482.9594999999999,null,null,null,null,518,40331.752999999997,null,519,13481.449999999999]
[null,null,520,43814.712499999994,null,null,520,3482.9594999999999,null,null,null,null,519,40331.752999999997,null,520,13481.449999999999]
[null,null,521,43814.712499999994,null,null,521,3482.9594999999999,null,null,null,null,520,40331.752999999997,null,521,13481.449999999999]
[null,null,522,43814.712499999994,null,null,522,3482.9594999999999,null,null,null,null,521,40331.752999999997,null,522,13481.449999999999]
[null,null,523,43814.712499999994,null,null,523,3482.9594999999999,null,null,null,null,522,40331.752999999997,null,523,13481.449999999999]
[null,null,524,43814.712499999994,null,null,524,3482.9594999999999,null,null,null,null,523,40331.752999999997,null,524,13481.449999999999]
[null,null,525,43814.712499999994,null,null,525,3482.9594999999999,null,null,null,null,524,40331.752999999997,null,525,13481.449999999999]
[null,null,526,43814.712499999994,null,null,526,3482.9594999999999,null,null,null,null,525,40331.752999999997,null,526,13481.449999999999]
[null,null,527,43814.712499999994,null,null,527,3482.9594999999999,null,null,null,null,526,40331.752999999997,null,527,13481.449999999999]
[null,null,528,43814.712499999994,null,null,528,3482.9594999999999,null,null,null,null,527,40331.752999999997,null,528,13481.449999999999]
[null,null,529,43814.712499999994,null,null,529,3482.9594999999999,null,null,null,null,528,40331.752999999997,null,529,13481.449999999999]
[null,null,530,43814.712499999994,null,null,530,3482.9594999999999,null,null,null,null,529,40331.752999999997,null,530,13481.449999999999]
[null,null,531,43814.712499999994,null,null,531,3482.9594999999999,null,null,null,null,530,40331.752999999997,null,531,13481.449999999999]
[null,null,532,43814.712499999994,null,null,532,3482.9594999999999,null,null,null,null,531,40331.752999999997,null,532,13481.449999999999]
[null,null,533,43814.712499999994,null,null,533,3482.9594999999999,null,null,null,null,532,40331.752999999997,null,533,13481.449999999999]
[null,null,534,43814.712499999994,null,null,534,3482.9594999999999,null,null,null,null,533,40331.752999999997,null,534,13481.449999999999]
[null,null,535,43814.712499999994,null,null,535,3482.9594999999999,null,null,null,null,534,40331.752999999997,null,535,13481.449999999999]
[null,null,536,43814.712499999994,null,null,536,3482.9594999999999,null,null,null,null,535,40331.752999999997,null,536,13481.449999999999]
[null,null,537,43814.712499999994,null,null,537,3482.9594999999999,null,null,null,null,536,40331.752999999997,null,537,13481.449999999999]
[null,null,538,43814.712499999994,null,null,538,3482.9594999999999,null,null,null,null,537,40331.752999999997,null,538,13481.449999999999]
[null,null,539,43814.712499999994,null,null,539,3482.9594999999999,null,null,null,null,538,40331.752999999997,null,539,13481.449999999999]
[null,null,540,43814.712499999994,null,null,540,3482.9594999999999,null,null,null,null,539,40331.752999999997,null,540,13481.449999999999]
[null,null,541,43814.712499999994,null,null,541,3482.9594999999999,null,null,null,null,540,40331.752999999997,null,541,13481.449999999999]
[null,null,542,43814.712499999994,null,null,542,3482.9594999999999,null,null,null,null,541,40331.752999999997,null,542,13481.449999999999]
[null,null,543,43814.712499999994,null,null,543,3482.9594999999999,null,null,null,null,542,40331.752999999997,null,543,13481.449999999999]
[null,null,544,43814.712499999994,null,null,544,3482.9594999999999,null,null,null,null,543,40331.752999999997,null,544,13481.449999999999]
[null,null,545,43814.712499999994,null,null,545,3482.9594999999999,null,null,null,null,544,40331.752999999997,null,545,13481.449999999999]
[null,null,546,43814.712499999994,null,null,546,3482.9594999999999,null,null,null,null,545,40331.752999999997,null,546,13481.449999999999]
[null,null,547,43814.712499999994,null,null,547,3482.9594999999999,null,null,null,null,546,40331.752999999997,null,547,13481.449999999999]
[null,null,548,43814.712499999994,null,null,548,3482.9594999999999,null,null,null,null,547,40331.752999999997,null,548,13481.449999999999]
[null,null,549,43814.712499999994,null,null,549,3482.9594999999999,null,null,null,null,548,40331.752999999997,null,549,13481.449999999999]
[null,null,550,43814.712499999994,null,null,550,3482.9594999999999,null,null,null,null,549,40331.752999999997,null,550,13481.449999999999]
[null,null,551,43814.712499999994,null,null,551,3482.9594999999999,null,null,null,null,550,40331.752999999997,null,551,13481.449999999999]
[null,null,552,43814.712499999994,null,null,552,3482.9594999999999,null,null,null,null,551,40331.752999999997,null,552,13481.449999999999]
[null,null,553,43814.712499999994,null,null,553,3482.9594999999999,null,null,null,null,552,40331.752999999997,null,553,13481.449999999999]
[null,null,554,43814.712499999994,null,null,554,3482.9594999999999,null,null,null,null,553,40331.752999999997,null,554,13481.449999999999]
[null,null,555,43814.712499999994,null,null,555,3482.9594999999999,null,null,null,null,554,40331.752999999997,null,555,13481.449999999999]
[null,null,556,43814.712499999994,null,null,556,3482.9594999999999,null,null,null,null,555,40331.752999999997,null,556,13481.449999999999]
[null,null,557,43814.712499999994,null,null,557,3482.9594999999999,null,null,null,null,556,40331.752999999997,null,557,13481.449999999999]
[null,null,558,43814.712499999994,null,null,558,3482.9594999999999,null,null,null,null,557,40331.752999999997,null,558,13481.449999999999]
[null,null,559,43814.712499999994,null,null,559,3482.9594999999999,null,null,null,null,558,40331.752999999997,null,559,13481.449999999999]
[null,null,560,43814.712499999994,null,null,560,3482.9594999999999,null,null,null,null,559,40331.752999999997,null,560,13481.449999999999]
[null,null,561,43814.712499999994,null,null,561,3482.9594999999999,null,null,null,null,560,40331.752999999997,null,561,13481.449999999999]
[null,null,562,43814.712499999994,null,null,562,3482.9594999999999,null,null,null,null,561,40331.752999999997,null,562,13481.449999999999]
[null,null,563,43814.712499999994,null,null,563,3482.9594999999999,null,null,null,null,562,40331.752999999997,null,563,13481.449999999999]
[null,null,564,43814.712499999994,null,null,564,3482.9594999999999,null,null,null,null,563,40331.752999999997,null,564,13481.449999999999]
[null,null,565,43814.712499999994,null,null,565,3482.9594999999999,null,null,null,null,564,40331.752999999997,null,565,13481.449999999999]
[null,null,566,43814.712499999994,null,null,566,3482.9594999999999,null,null,null,null,565,40331.752999999997,null,566,13481.449999999999]
[null,null,567,43814.712499999994,null,null,567,3482.9594999999999,null,null,null,null,566,40331.752999999997,null,567,13481.449999999999]
[null,null,568,43814.712499999994,null,null,568,3482.9594999999999,null,null,null,null,567,40331.752999999997,null,568,13481.449999999999]
[null,null,569,43814.712499999994,null,null,569,3482.9594999999999,null,null,null,null,568,40331.752999999997,null,569,13481.449999999999]
[null,null,570,43814.712499999994,null,null,570,3482.9594999999999,null,null,null,null,569,40331.752999999997,null,570,13481.449999999999]
[null,null,571,43814.712499999994,null,null,571,3482.9594999999999,null,null,null,null,570,40331.752999999997,null,571,13481.449999999999]
[null,null,572,43814.712499999994,null,null,572,3482.9594999999999,null,null,null,null,571,40331.752999999997,null,572,13481.449999999999]
[null,null,573,43814.712499999994,null,null,573,3482.9594999999999,null,null,null,null,572,40331.752999999997,null,573,13481.449999999999]
[null,null,574,43814.712499999994,null,null,574,3482.9594999999999,null,null,null,null,573,40331.752999999997,null,574,13481.449999999999]
[null,null,575,43814.712499999994,null,null,575,3482.9594999999999,null,null,null,null,574,40331.752999999997,null,575,13481.449999999999]
[null,null,576,43814.712499999994,null,null,576,3482.9594999999999,null,null,null,null,575,40331.752999999997,null,576,13481.449999999999]
[null,null,577,43814.712499999994,null,null,577,3482.9594999999999,null,null,null,null,576,40331.752999999997,null,577,13481.449999999999]
[null,null,578,43814.712499999994,null,null,578,3482.9594999999999,null,null,null,null,577,40331.752999999997,null,578,13481.449999999999]
[null,null,579,43814.712499999994,null,null,579,3482.9594999999999,null,null,null,null,578,40331.752999999997,null,579,13481.449999999999]
[null,null,580,43814.712499999994,null,null,580,3482.9594999999999,null,null,null,null,579,40331.752999999997,null,580,13481.449999999999]
[null,null,581,43814.712499999994,null,null,581,3482.9594999999999,null,null,null,null,580,40331.752999999997,null,581,13481.449999999999]
[null,null,582,43814.712499999994,null,null,582,3482.9594999999999,null,null,null,null,581,40331.752999999997,null,582,13481.449999999999]
[null,null,583,43814.712499999994,null,null,583,3482.9594999999999,null,null,null,null,582,40331.752999999997,null,583,13481.449999999999]
[null,null,584,43814.712499999994,null,null,584,3482.9594999999999,null,null,null,null,583,40331.752999999997,null,584,13481.449999999999]
[null,null,585,43814.712499999994,null,null,585,3482.9594999999999,null,null,null,null,584,40331.752999999997,null,585,13481.449999999999]
[null,null,586,43814.712499999994,null,null,586,3482.9594999999999,null,null,null,null,585,40331.752999999997,null,586,13481.449999999999]
[null,null,587,43814.712499999994,null,null,587,3482.9594999999999,null,null,null,null,586,40331.752999999997,null,587,13481.449999999999]
[null,null,588,43814.712499999994,null,null,588,3482.9594999999999,null,null,null,null,587,40331.752999999997,null,588,13481.449999999999]
[null,null,589,43814.712499999994,null,null,589,3482.9594999999999,null,null,null,null,588,40331.752999999997,null,589,13481.449999999999]
[null,null,590,43814.712499999994,null,null,590,3482.9594999999999,null,null,null,null,589,40331.752999999997,null,590,13481.449999999999]
[null,null,591,43814.712499999994,null,null,591,3482.9594999999999,null,null,null,null,590,40331.752999999997,null,591,13481.449999999999]
[null,null,592,43814.712499999994,null,null,592,3482.9594999999999,null,null,null,null,591,40331.752999999997,null,592,13481.449999999999]
[null,null,593,43814.712499999994,null,null,593,3482.9594999999999,null,null,null,null,592,40331.752999999997,null,593,13481.449999999999]
[null,null,594,43814.712499999994,null,null,594,3482.9594999999999,null,null,null,null,593,40331.752999999997,null,594,13481.449999999999]
[null,null,595,43814.712499999994,null,null,595,3482.9594999999999,null,null,null,null,594,40331.752999999997,null,595,13481.449999999999]
[null,null,596,43814.712499999994,null,null,596,3482.9594999999999,null,null,null,null,595,40331.752999999997,null,596,13481.449999999999]
[null,null,597,43814.712499999994,null,null,597,3482.9594999999999,null,null,null,null,596,40331.752999999997,null,597,13481.449999999999]
[null,null,598,43814.712499999994,null,null,598,3482.9594999999999,null,null,null,null,597,40331.752999999997,null,598,13481.449999999999]
[null,null,599,43814.712499999994,null,null,599,3482.9594999999999,null,null,null,null,598,40331.752999999997,null,599,13481.449999999999]
[null,null,600,43814.712499999994,null,null,600,3482.9594999999999,null,null,null,null,599,40331.752999999997,null,600,13481.449999999999]
[null,null,601,43814.712499999994,null,null,601,3482.9594999999999,null,null,null,null,600,40331.752999999997,null,601,13481.449999999999]
[null,null,602,43814.712499999994,null,null,602,3482.9594999999999,null,null,null,null,601,40331.752999999997,null,602,13481.449999999999]
[null,null,603,43814.712499999994,null,null,603,3482.9594999999999,null,null,null,null,602,40331.752999999997,null,603,13481.449999999999]
[null,null,604,43814.712499999994,null,null,604,3482.9594999999999,null,null,null,null,603,40331.752999999997,null,604,13481.449999999999]
[null,null,605,43814.712499999994,null,null,605,3482.9594999999999,null,null,null,null,604,40331.752999999997,null,605,13481.449999999999]
[null,null,606,43814.712499999994,null,null,606,3482.9594999999999,null,null,null,null,605,40331.752999999997,null,606,13481.449999999999]
[null,null,607,43814.712499999994,null,null,607,3482.9594999999999,null,null,null,null,606,40331.752999999997,null,607,13481.449999999999]
[null,null,608,43814.712499999994,null,null,608,3482.9594999999999,null,null,null,null,607,40331.752999999997,null,608,13481.449999999999]
[null,null,609,43814.712499999994,null,null,609,3482.9594999999999,null,null,null,null,608,40331.752999999997,null,609,13481.449999999999]
[null,null,610,43814.712499999994,null,null,610,3482.9594999999999,null,null,null,null,609,40331.752999999997,null,610,13481.449999999999]
[null,null,611,43814.712499999994,null,null,611,3482.9594999999999,null,null,null,null,610,40331.752999999997,null,611,13481.449999999999]
[null,null,612,43814.712499999994,null,null,612,3482.9594999999999,null,null,null,null,611,40331.752999999997,null,612,13481.449999999999]
[null,null,613,43814.712499999994,null,null,613,3482.9594999999999,null,null,null,null,612,40331.752999999997,null,613,13481.449999999999]
[null,null,614,43814.712499999994,null,null,614,3482.9594999999999,null,null,null,null,613,40331.752999999997,null,614,13481.449999999999]
[null,null,615,43814.712499999994,null,null,615,3482.9594999999999,null,null,null,null,614,40331.752999999997,null,615,13481.449999999999]
[null,null,616,43814.712499999994,null,null,616,3482.9594999999999,null,null,null,null,615,40331.752999999997,null,616,13481.449999999999]
[null,null,617,43814.712499999994,null,null,617,3482.9594999999999,null,null,null,null,616,40331.752999999997,null,617,13481.449999999999]
[null,null,618,43814.712499999994,null,null,618,3482.9594999999999,null,null,null,null,617,40331.752999999997,null,618,13481.449999999999]
[null,null,619,43814.712499999994,null,null,619,3482.9594999999999,null,null,null,null,618,40331.752999999997,null,619,13481.449999999999]
[null,null,620,43814.712499999994,null,null,620,3482.9594999999999,null,null,null,null,619,40331.752999999997,null,620,13481.449999999999]
[null,null,621,43814.712499999994,null,null,621,3482.9594999999999,null,null,null,null,620,40331.752999999997,null,621,13481.449999999999]
[null,null,622,43814.712499999994,null,null,622,3482.9594999999999,null,null,null,null,621,40331.752999999997,null,622,13481.449999999999]
[null,null,623,43814.712499999994,null,null,623,3482.9594999999999,null,null,null,null,622,40331.752999999997,null,623,13481.449999999999]
[null,null,624,43814.712499999994,null,null,624,3482.9594999999999,null,null,null,null,623,40331.752999999997,null,624,13481.449999999999]
[null,null,625,43814.712499999994,null,null,625,3482.9594999999999,null,null,null,null,624,40331.752999999997,null,625,13481.449999999999]
[null,null,626,43814.712499999994,null,null,626,3482.9594999999999,null,null,null,null,625,40331.752999999997,null,626,13481.449999999999]
[null,null,627,43814.712499999994,null,null,627,3482.9594999999999,null,null,null,null,626,40331.752999999997,null,627,13481.449999999999]
[null,null,628,43814.712499999994,null,null,628,3482.9594999999999,null,null,null,null,627,40331.752999999997,null,628,13481.449999999999]
[null,null,629,43814.712499999994,null,null,629,3482.9594999999999,null,null,null,null,628,40331.752999999997,null,629,13481.449999999999]
[null,null,630,43814.712499999994,null,null,630,3482.9594999999999,null,null,null,null,629,40331.752999999997,null,630,13481.449999999999]
[null,null,631,43814.712499999994,null,null,631,3482.9594999999999,null,null,null,null,630,40331.752999999997,null,631,13481.449999999999]
[null,null,632,43814.712499999994,null,null,632,3482.9594999999999,null,null,null,null,631,40331.752999999997,null,632,13481.449999999999]
[null,null,633,43814.712499999994,null,null,633,3482.9594999999999,null,null,null,null,632,40331.752999999997,null,633,13481.449999999999]
[null,null,634,43814.712499999994,null,null,634,3482.9594999999999,null,null,null,null,633,40331.752999999997,null,634,13481.449999999999]
[null,null,635,43814.712499999994,null,null,635,3482.9594999999999,null,null,null,null,634,40331.752999999997,null,635,13481.449999999999]
[null,null,636,43814.712499999994,null,null,636,3482.9594999999999,null,null,null,null,635,40331.752999999997,null,636,13481.449999999999]
[null,null,637,43814.712499999994,null,null,637,3482.9594999999999,null,null,null,null,636,40331.752999999997,null,637,13481.449999999999]
[null,null,638,43814.712499999994,null,null,638,3482.9594999999999,null,null,null,null,637,40331.752999999997,null,638,13481.449999999999]
[null,null,639,43814.712499999994,null,null,639,3482.9594999999999,null,null,null,null,638,40331.752999999997,null,639,13481.449999999999]
[null,null,640,43814.712499999994,null,null,640,3482.9594999999999,null,null,null,null,639,40331.752999999997,null,640,13481.449999999999]
[null,null,641,43814.712499999994,null,null,641,3482.9594999999999,null,null,null,null,640,40331.752999999997,null,641,13481.449999999999]
[null,null,642,43814.712499999994,null,null,642,3482.9594999999999,null,null,null,null,641,40331.752999999997,null,642,13481.449999999999]
[null,null,643,43814.712499999994,null,null,643,3482.9594999999999,null,null,null,null,642,40331.752999999997,null,643,13481.449999999999]
[null,null,644,43814.712499999994,null,null,644,3482.9594999999999,null,null,null,null,643,40331.752999999997,null,644,13481.449999999999]
[null,null,645,43814.712499999994,null,null,645,3482.9594999999999,null,null,null,null,644,40331.752999999997,null,645,13481.449999999999]
[null,null,646,43814.712499999994,null,null,646,3482.9594999999999,null,null,null,null,645,40331.752999999997,null,646,13481.449999999999]
[null,null,647,43814.712499999994,null,null,647,3482.9594999999999,null,null,null,null,646,40331.752999999997,null,647,13481.449999999999]
[null,null,648,43814.712499999994,null,null,648,3482.9594999999999,null,null,null,null,647,40331.752999999997,null,648,13481.449999999999]
[null,null,649,43814.712499999994,null,null,649,3482.9594999999999,null,null,null,null,648,40331.752999999997,null,649,13481.449999999999]
[null,null,650,43814.712499999994,null,null,650,3482.9594999999999,null,null,null,null,649,40331.752999999997,null,650,13481.449999999999]
[null,null,651,43814.712499999994,null,null,651,3482.9594999999999,null,null,null,null,650,40331.752999999997,null,651,13481.449999999999]
[null,null,652,43814.712499999994,null,null,652,3482.9594999999999,null,null,null,null,651,40331.752999999997,null,652,13481.449999999999]
[null,null,653,43814.712499999994,null,null,653,3482.9594999999999,null,null,null,null,652,40331.752999999997,null,653,13481.449999999999]
[null,null,654,43814.712499999994,null,null,654,3482.9594999999999,null,null,null,null,653,40331.752999999997,null,654,13481.449999999999]
[null,null,655,43814.712499999994,null,null,655,3482.9594999999999,null,null,null,null,654,40331.752999999997,null,655,13481.449999999999]
[null,null,656,43814.712499999994,null,null,656,3482.9594999999999,null,null,null,null,655,40331.752999999997,null,656,13481.449999999999]
[null,null,657,43814.712499999994,null,null,657,3482.9594999999999,null,null,null,null,656,40331.752999999997,null,657,13481.449999999999]
[null,null,658,43814.712499999994,null,null,658,3482.9594999999999,null,null,null,null,657,40331.752999999997,null,658,13481.449999999999]
[null,null,659,43814.712499999994,null,null,659,3482.9594999999999,null,null,null,null,658,40331.752999999997,null,659,13481.449999999999]
[null,null,660,43814.712499999994,null,null,660,3482.9594999999999,null,null,null,null,659,40331.752999999997,null,660,13481.449999999999]
[null,null,661,43814.712499999994,null,null,661,3482.9594999999999,null,null,null,null,660,40331.752999999997,null,661,13481.449999999999]
[null,null,662,43814.712499999994,null,null,662,3482.9594999999999,null,null,null,null,661,40331.752999999997,null,662,13481.449999999999]
[null,null,663,43814.712499999994,null,null,663,3482.9594999999999,null,null,null,null,662,40331.752999999997,null,663,13481.449999999999]
[null,null,664,43814.712499999994,null,null,664,3482.9594999999999,null,null,null,null,663,40331.752999999997,null,664,13481.449999999999]
[null,null,665,43814.712499999994,null,null,665,3482.9594999999999,null,null,null,null,664,40331.752999999997,null,665,13481.449999999999]
[null,null,666,43814.712499999994,null,null,666,3482.9594999999999,null,null,null,null,665,40331.752999999997,null,666,13481.449999999999]
[null,null,667,43814.712499999994,null,null,667,3482.9594999999999,null,null,null,null,666,40331.752999999997,null,667,13481.449999999999]
[null,null,668,43814.712499999994,null,null,668,3482.9594999999999,null,null,null,null,667,40331.752999999997,null,668,13481.449999999999]
[null,null,669,43814.712499999994,null,null,669,3482.9594999999999,null,null,null,null,668,40331.752999999997,null,669,13481.449999999999]
[null,null,670,43814.712499999994,null,null,670,3482.9594999999999,null,null,null,null,669,40331.752999999997,null,670,13481.449999999999]
[null,null,671,43814.712499999994,null,null,671,3482.9594999999999,null,null,null,null,670,40331.752999999997,null,671,13481.449999999999]
[null,null,672,43814.712499999994,null,null,672,3482.9594999999999,null,null,null,null,671,40331.752999999997,null,672,13481.449999999999]
[null,null,673,43814.712499999994,null,null,673,3482.9594999999999,null,null,null,null,672,40331.752999999997,null,673,13481.449999999999]
[null,null,674,43814.712499999994,null,null,674,3482.9594999999999,null,null,null,null,673,40331.752999999997,null,674,13481.449999999999]
[null,null,675,43814.712499999994,null,null,675,3482.9594999999999,null,null,null,null,674,40331.752999999997,null,675,13481.449999999999]
[null,null,676,43814.712499999994,null,null,676,3482.9594999999999,null,null,null,null,675,40331.752999999997,null,676,13481.449999999999]
[null,null,677,43814.712499999994,null,null,677,3482.9594999999999,null,null,null,null,676,40331.752999999997,null,677,13481.449999999999]
[null,null,678,43814.712499999994,null,null,678,3482.9594999999999,null,null,null,null,677,40331.752999999997,null,678,13481.449999999999]
[null,null,679,43814.712499999994,null,null,679,3482.9594999999999,null,null,null,null,678,40331.752999999997,null,679,13481.449999999999]
[null,null,680,43814.712499999994,null,null,680,3482.9594999999999,null,null,null,null,679,40331.752999999997,null,680,13481.449999999999]
[null,null,681,43814.712499999994,null,null,681,3482.9594999999999,null,null,null,null,680,40331.752999999997,null,681,13481.449999999999]
[null,null,682,43814.712499999994,null,null,682,3482.9594999999999,null,null,null,null,681,40331.752999999997,null,682,13481.449999999999]
[null,null,683,43814.712499999994,null,null,683,3482.9594999999999,null,null,null,null,682,40331.752999999997,null,683,13481.449999999999]
[null,null,684,43814.712499999994,null,null,684,3482.9594999999999,null,null,null,null,683,40331.752999999997,null,684,13481.449999999999]
[null,null,685,43814.712499999994,null,null,685,3482.9594999999999,null,null,null,null,684,40331.752999999997,null,685,13481.449999999999]
[null,null,686,43814.712499999994,null,null,686,3482.9594999999999,null,null,null,null,685,40331.752999999997,null,686,13481.449999999999]
[null,null,687,43814.712499999994,null,null,687,3482.9594999999999,null,null,null,null,686,40331.752999999997,null,687,13481.449999999999]
[null,null,688,43814.712499999994,null,null,688,3482.9594999999999,null,null,null,null,687,40331.752999999997,null,688,13481.449999999999]
[null,null,689,43814.712499999994,null,null,689,3482.9594999999999,null,null,null,null,688,40331.752999999997,null,689,13481.449999999999]
[null,null,690,43814.712499999994,null,null,690,3482.9594999999999,null,null,null,null,689,40331.752999999997,null,690,13481.449999999999]
[null,null,691,43814.712499999994,null,null,691,3482.9594999999999,null,null,null,null,690,40331.752999999997,null,691,13481.449999999999]
[null,null,692,43814.712499999994,null,null,692,3482.9594999999999,null,null,null,null,691,40331.752999999997,null,692,13481.449999999999]
[null,null,693,43814.712499999994,null,null,693,3482.9594999999999,null,null,null,null,692,40331.752999999997,null,693,13481.449999999999]
[null,null,694,43814.712499999994,null,null,694,3482.9594999999999,null,null,null,null,693,40331.752999999997,null,694,13481.449999999999]
[null,null,695,43814.712499999994,null,null,695,3482.9594999999999,null,null,null,null,694,40331.752999999997,null,695,13481.449999999999]
[null,null,696,43814.712499999994,null,null,696,3482.9594999999999,null,null,null,null,695,40331.752999999997,null,696,13481.449999999999]
[null,null,697,43814.712499999994,null,null,697,3482.9594999999999,null,null,null,null,696,40331.752999999997,null,697,13481.449999999999]
[null,null,698,43814.712499999994,null,null,698,3482.9594999999999,null,null,null,null,697,40331.752999999997,null,698,13481.449999999999]
[null,null,699,43814.712499999994,null,null,699,3482.9594999999999,null,null,null,null,698,40331.752999999997,null,699,13481.449999999999]
[null,null,700,43814.712499999994,null,null,700,3482.9594999999999,null,null,null,null,699,40331.752999999997,null,700,13481.449999999999]
[null,null,701,43814.712499999994,null,null,701,3482.9594999999999,null,null,null,null,700,40331.752999999997,null,701,13481.449999999999]
[null,null,702,43814.712499999994,null,null,702,3482.9594999999999,null,null,null,null,701,40331.752999999997,null,702,13481.449999999999]
[null,null,703,43814.712499999994,null,null,703,3482.9594999999999,null,null,null,null,702,40331.752999999997,null,703,13481.449999999999]
[null,null,704,43814.712499999994,null,null,704,3482.9594999999999,null,null,null,null,703,40331.752999999997,null,704,13481.449999999999]
[null,null,705,43814.712499999994,null,null,705,3482.9594999999999,null,null,null,null,704,40331.752999999997,null,705,13481.449999999999]
[null,null,706,43814.712499999994,null,null,706,3482.9594999999999,null,null,null,null,705,40331.752999999997,null,706,13481.449999999999]
[null,null,707,43814.712499999994,null,null,707,3482.9594999999999,null,null,null,null,706,40331.752999999997,null,707,13481.449999999999]
[null,null,708,43814.712499999994,null,null,708,3482.9594999999999,null,null,null,null,707,40331.752999999997,null,708,13481.449999999999]
[null,null,709,43814.712499999994,null,null,709,3482.9594999999999,null,null,null,null,708,40331.752999999997,null,709,13481.449999999999]
[null,null,710,43814.712499999994,null,null,710,3482.9594999999999,null,null,null,null,709,40331.752999999997,null,710,13481.449999999999]
[null,null,711,43814.712499999994,null,null,711,3482.9594999999999,null,null,null,null,710,40331.752999999997,null,711,13481.449999999999]
[null,null,712,43814.712499999994,null,null,712,3482.9594999999999,null,null,null,null,711,40331.752999999997,null,712,13481.449999999999]
[null,null,713,43814.712499999994,null,null,713,3482.9594999999999,null,null,null,null,712,40331.752999999997,null,713,13481.449999999999]
[null,null,714,43814.712499999994,null,null,714,3482.9594999999999,null,null,null,null,713,40331.752999999997,null,714,13481.449999999999]
[null,null,715,43814.712499999994,null,null,715,3482.9594999999999,null,null,null,null,714,40331.752999999997,null,715,13481.449999999999]
[null,null,716,43814.712499999994,null,null,716,3482.9594999999999,null,null,null,null,715,40331.752999999997,null,716,13481.449999999999]
[null,null,717,43814.712499999994,null,null,717,3482.9594999999999,null,null,null,null,716,40331.752999999997,null,717,13481.449999999999]
[null,null,718,43814.712499999994,null,null,718,3482.9594999999999,null,null,null,null,717,40331.752999999997,null,718,13481.449999999999]
[null,null,719,43814.712499999994,null,null,719,3482.9594999999999,null,null,null,null,718,40331.752999999997,null,719,13481.449999999999]
[null,null,720,43814.712499999994,null,null,720,3482.9594999999999,null,null,null,null,719,40331.752999999997,null,720,13481.449999999999]
[null,null,721,43814.712499999994,null,null,721,3482.9594999999999,null,null,null,null,720,40331.752999999997,null,721,13481.449999999999]
[null,null,722,43814.712499999994,null,null,722,3482.9594999999999,null,null,null,null,721,40331.752999999997,null,722,13481.449999999999]
[null,null,723,43814.712499999994,null,null,723,3482.9594999999999,null,null,null,null,722,40331.752999999997,null,723,13481.449999999999]
[null,null,724,43814.712499999994,null,null,724,3482.9594999999999,null,null,null,null,723,40331.752999999997,null,724,13481.449999999999]
[null,null,725,43814.712499999994,null,null,725,3482.9594999999999,null,null,null,null,724,40331.752999999997,null,725,13481.449999999999]
[null,null,726,43814.712499999994,null,null,726,3482.9594999999999,null,null,null,null,725,40331.752999999997,null,726,13481.449999999999]
[null,null,727,43814.712499999994,null,null,727,3482.9594999999999,null,null,null,null,726,40331.752999999997,null,727,13481.449999999999]
[null,null,728,43814.712499999994,null,null,728,3482.9594999999999,null,null,null,null,727,40331.752999999997,null,728,13481.449999999999]
[null,null,729,43814.712499999994,null,null,729,3482.9594999999999,null,null,null,null,728,40331.752999999997,null,729,13481.449999999999]
[null,null,730,43814.712499999994,null,null,730,3482.9594999999999,null,null,null,null,729,40331.752999999997,null,730,13481.449999999999]
[null,null,731,43814.712499999994,null,null,731,3482.9594999999999,null,null,null,null,730,40331.752999999997,null,731,13481.449999999999]
[null,null,732,43814.712499999994,null,null,732,3482.9594999999999,null,null,null,null,731,40331.752999999997,null,732,13481.449999999999]
[null,null,733,43814.712499999994,null,null,733,3482.9594999999999,null,null,null,null,732,40331.752999999997,null,733,13481.449999999999]
[null,null,734,43814.712499999994,null,null,734,3482.9594999999999,null,null,null,null,733,40331.752999999997,null,734,13481.449999999999]
[null,null,735,43814.712499999994,null,null,735,3482.9594999999999,null,null,null,null,734,40331.752999999997,null,735,13481.449999999999]
[null,null,736,43814.712499999994,null,null,736,3482.9594999999999,null,null,null,null,735,40331.752999999997,null,736,13481.449999999999]
[null,null,737,43814.712499999994,null,null,737,3482.9594999999999,null,null,null,null,736,40331.752999999997,null,737,13481.449999999999]
[null,null,738,43814.712499999994,null,null,738,3482.9594999999999,null,null,null,null,737,40331.752999999997,null,738,13481.449999999999]
[null,null,739,43814.712499999994,null,null,739,3482.9594999999999,null,null,null,null,738,40331.752999999997,null,739,13481.449999999999]
[null,null,740,43814.712499999994,null,null,740,3482.9594999999999,null,null,null,null,739,40331.752999999997,null,740,13481.449999999999]
[null,null,741,43814.712499999994,null,null,741,3482.9594999999999,null,null,null,null,740,40331.752999999997,null,741,13481.449999999999]
[null,null,742,43814.712499999994,null,null,742,3482.9594999999999,null,null,null,null,741,40331.752999999997,null,742,13481.449999999999]
[null,null,743,43814.712499999994,null,null,743,3482.9594999999999,null,null,null,null,742,40331.752999999997,null,743,13481.449999999999]
[null,null,744,43814.712499999994,null,null,744,3482.9594999999999,null,null,null,null,743,40331.752999999997,null,744,13481.449999999999]
[null,null,745,43814.712499999994,null,null,745,3482.9594999999999,null,null,null,null,744,40331.752999999997,null,745,13481.449999999999]
[null,null,746,43814.712499999994,null,null,746,3482.9594999999999,null,null,null,null,745,40331.752999999997,null,746,13481.449999999999]
[null,null,747,43814.712499999994,null,null,747,3482.9594999999999,null,null,null,null,746,40331.752999999997,null,747,13481.449999999999]
[null,null,748,43814.712499999994,null,null,748,3482.9594999999999,null,null,null,null,747,40331.752999999997,null,748,13481.449999999999]
[null,null,749,43814.712499999994,null,null,749,3482.9594999999999,null,null,null,null,748,40331.752999999997,null,749,13481.449999999999]
[null,null,750,43814.712499999994,null,null,750,3482.9594999999999,null,null,null,null,749,40331.752999999997,null,750,13481.449999999999]
[null,null,751,43814.712499999994,null,null,751,3482.9594999999999,null,null,null,null,750,40331.752999999997,null,751,13481.449999999999]
[null,null,752,43814.712499999994,null,null,752,3482.9594999999999,null,null,null,null,751,40331.752999999997,null,752,13481.449999999999]
[null,null,753,43814.712499999994,null,null,753,3482.9594999999999,null,null,null,null,752,40331.752999999997,null,753,13481.449999999999]
[null,null,754,43814.712499999994,null,null,754,3482.9594999999999,null,null,null,null,753,40331.752999999997,null,754,13481.449999999999]
[null,null,755,43814.712499999994,null,null,755,3482.9594999999999,null,null,null,null,754,40331.752999999997,null,755,13481.449999999999]
[null,null,756,43814.712499999994,null,null,756,3482.9594999999999,null,null,null,null,755,40331.752999999997,null,756,13481.449999999999]
[null,null,757,43814.712499999994,null,null,757,3482.9594999999999,null,null,null,null,756,40331.752999999997,null,757,13481.449999999999]
[null,null,758,43814.712499999994,null,null,758,3482.9594999999999,null,null,null,null,757,40331.752999999997,null,758,13481.449999999999]
[null,null,759,43814.712499999994,null,null,759,3482.9594999999999,null,null,null,null,758,40331.752999999997,null,759,13481.449999999999]
[null,null,760,43814.712499999994,null,null,760,3482.9594999999999,null,null,null,null,759,40331.752999999997,null,760,13481.449999999999]
[null,null,761,43814.712499999994,null,null,761,3482.9594999999999,null,null,null,null,760,40331.752999999997,null,761,13481.449999999999]
[null,null,762,43814.712499999994,null,null,762,3482.9594999999999,null,null,null,null,761,40331.752999999997,null,762,13481.449999999999]
[null,null,763,43814.712499999994,null,null,763,3482.9594999999999,null,null,null,null,762,40331.752999999997,null,763,13481.449999999999]
[null,null,764,43814.712499999994,null,null,764,3482.9594999999999,null,null,null,null,763,40331.752999999997,null,764,13481.449999999999]
[null,null,765,43814.712499999994,null,null,765,3482.9594999999999,null,null,null,null,764,40331.752999999997,null,765,13481.449999999999]
[null,null,766,43814.712499999994,null,null,766,3482.9594999999999,null,null,null,null,765,40331.752999999997,null,766,13481.449999999999]
[null,null,767,43814.712499999994,null,null,767,3482.9594999999999,null,null,null,null,766,40331.752999999997,null,767,13481.449999999999]
[null,null,768,43814.712499999994,null,null,768,3482.9594999999999,null,null,null,null,767,40331.752999999997,null,768,13481.449999999999]
[null,null,769,43814.712499999994,null,null,769,3482.9594999999999,null,null,null,null,768,40331.752999999997,null,769,13481.449999999999]
[null,null,770,43814.712499999994,null,null,770,3482.9594999999999,null,null,null,null,769,40331.752999999997,null,770,13481.449999999999]
[null,null,771,43814.712499999994,null,null,771,3482.9594999999999,null,null,null,null,770,40331.752999999997,null,771,13481.449999999999]
[null,null,772,43814.712499999994,null,null,772,3482.9594999999999,null,null,null,null,771,40331.752999999997,null,772,13481.449999999999]
[null,null,773,43814.712499999994,null,null,773,3482.9594999999999,null,null,null,null,772,40331.752999999997,null,773,13481.449999999999]
[null,null,774,43814.712499999994,null,null,774,3482.9594999999999,null,null,null,null,773,40331.752999999997,null,774,13481.449999999999]
[null,null,775,43814.712499999994,null,null,775,3482.9594999999999,null,null,null,null,774,40331.752999999997,null,775,13481.449999999999]
[null,null,776,43814.712499999994,null,null,776,3482.9594999999999,null,null,null,null,775,40331.752999999997,null,776,13481.449999999999]
[null,null,777,43814.712499999994,null,null,777,3482.9594999999999,null,null,null,null,776,40331.752999999997,null,777,13481.449999999999]
[null,null,778,43814.712499999994,null,null,778,3482.9594999999999,null,null,null,null,777,40331.752999999997,null,778,13481.449999999999]
[null,null,779,43814.712499999994,null,null,779,3482.9594999999999,null,null,null,null,778,40331.752999999997,null,779,13481.449999999999]
[null,null,780,43814.712499999994,null,null,780,3482.9594999999999,null,null,null,null,779,40331.752999999997,null,780,13481.449999999999]
[null,null,781,43814.712499999994,null,null,781,3482.9594999999999,null,null,null,null,780,40331.752999999997,null,781,13481.449999999999]
[null,null,782,43814.712499999994,null,null,782,3482.9594999999999,null,null,null,null,781,40331.752999999997,null,782,13481.449999999999]
[null,null,783,43814.712499999994,null,null,783,3482.9594999999999,null,null,null,null,782,40331.752999999997,null,783,13481.449999999999]
[null,null,784,43814.712499999994,null,null,784,3482.9594999999999,null,null,null,null,783,40331.752999999997,null,784,13481.449999999999]
[null,null,785,43814.712499999994,null,null,785,3482.9594999999999,null,null,null,null,784,40331.752999999997,null,785,13481.449999999999]
[null,null,786,43814.712499999994,null,null,786,3482.9594999999999,null,null,null,null,785,40331.752999999997,null,786,13481.449999999999]
[null,null,787,43814.712499999994,null,null,787,3482.9594999999999,null,null,null,null,786,40331.752999999997,null,787,13481.449999999999]
[null,null,788,43814.712499999994,null,null,788,3482.9594999999999,null,null,null,null,787,40331.752999999997,null,788,13481.449999999999]
[null,null,789,43814.712499999994,null,null,789,3482.9594999999999,null,null,null,null,788,40331.752999999997,null,789,13481.449999999999]
[null,null,790,43814.712499999994,null,null,790,3482.9594999999999,null,null,null,null,789,40331.752999999997,null,790,13481.449999999999]
[null,null,791,43814.712499999994,null,null,791,3482.9594999999999,null,null,null,null,790,40331.752999999997,null,791,13481.449999999999]
[null,null,792,43814.712499999994,null,null,792,3482.9594999999999,null,null,null,null,791,40331.752999999997,null,792,13481.449999999999]
[null,null,793,43814.712499999994,null,null,793,3482.9594999999999,null,null,null,null,792,40331.752999999997,null,793,13481.449999999999]
[null,null,794,43814.712499999994,null,null,794,3482.9594999999999,null,null,null,null,793,40331.752999999997,null,794,13481.449999999999]
[null,null,795,43814.712499999994,null,null,795,3482.9594999999999,null,null,null,null,794,40331.752999999997,null,795,13481.449999999999]
[null,null,796,43814.712499999994,null,null,796,3482.9594999999999,null,null,null,null,795,40331.752999999997,null,796,13481.449999999999]
[null,null,797,43814.712499999994,null,null,797,3482.9594999999999,null,null,null,null,796,40331.752999999997,null,797,13481.449999999999]
[null,null,798,43814.712499999994,null,null,798,3482.9594999999999,null,null,null,null,797,40331.752999999997,null,798,13481.449999999999]
[null,null,799,43814.712499999994,null,null,799,3482.9594999999999,null,null,null,null,798,40331.752999999997,null,799,13481.449999999999]
[null,null,800,43814.712499999994,null,null,800,3482.9594999999999,null,null,null,null,799,40331.752999999997,null,800,13481.449999999999]
[null,null,801,43814.712499999994,null,null,801,3482.9594999999999,null,null,null,null,800,40331.752999999997,null,801,13481.449999999999]
[null,null,802,43814.712499999994,null,null,802,3482.9594999999999,null,null,null,null,801,40331.752999999997,null,802,13481.449999999999]
[null,null,803,43814.712499999994,null,null,803,3482.9594999999999,null,null,null,null,802,40331.752999999997,null,803,13481.449999999999]
[null,null,804,43814.712499999994,null,null,804,3482.9594999999999,null,null,null,null,803,40331.752999999997,null,804,13481.449999999999]
[null,null,805,43814.712499999994,null,null,805,3482.9594999999999,null,null,null,null,804,40331.752999999997,null,805,13481.449999999999]
[null,null,806,43814.712499999994,null,null,806,3482.9594999999999,null,null,null,null,805,40331.752999999997,null,806,13481.449999999999]
[null,null,807,43814.712499999994,null,null,807,3482.9594999999999,null,null,null,null,806,40331.752999999997,null,807,13481.449999999999]
[null,null,808,43814.712499999994,null,null,808,3482.9594999999999,null,null,null,null,807,40331.752999999997,null,808,13481.449999999999]
[null,null,809,43814.712499999994,null,null,809,3482.9594999999999,null,null,null,null,808,40331.752999999997,null,809,13481.449999999999]
[null,null,810,43814.712499999994,null,null,810,3482.9594999999999,null,null,null,null,809,40331.752999999997,null,810,13481.449999999999]
[null,null,811,43814.712499999994,null,null,811,3482.9594999999999,null,null,null,null,810,40331.752999999997,null,811,13481.449999999999]
[null,null,812,43814.712499999994,null,null,812,3482.9594999999999,null,null,null,null,811,40331.752999999997,null,812,13481.449999999999]
[null,null,813,43814.712499999994,null,null,813,3482.9594999999999,null,null,null,null,812,40331.752999999997,null,813,13481.449999999999]
[null,null,814,43814.712499999994,null,null,814,3482.9594999999999,null,null,null,null,813,40331.752999999997,null,814,13481.449999999999]
[null,null,815,43814.712499999994,null,null,815,3482.9594999999999,null,null,null,null,814,40331.752999999997,null,815,13481.449999999999]
[null,null,816,43814.712499999994,null,null,816,3482.9594999999999,null,null,null,null,815,40331.752999999997,null,816,13481.449999999999]
[null,null,817,43814.712499999994,null,null,817,3482.9594999999999,null,null,null,null,816,40331.752999999997,null,817,13481.449999999999]
[null,null,818,43814.712499999994,null,null,818,3482.9594999999999,null,null,null,null,817,40331.752999999997,null,818,13481.449999999999]
[null,null,819,43814.712499999994,null,null,819,3482.9594999999999,null,null,null,null,818,40331.752999999997,null,819,13481.449999999999]
[null,null,820,43814.712499999994,null,null,820,3482.9594999999999,null,null,null,null,819,40331.752999999997,null,820,13481.449999999999]
[null,null,821,43814.712499999994,null,null,821,3482.9594999999999,null,null,null,null,820,40331.752999999997,null,821,13481.449999999999]
[null,null,822,43814.712499999994,null,null,822,3482.9594999999999,null,null,null,null,821,40331.752999999997,null,822,13481.449999999999]
[null,null,823,43814.712499999994,null,null,823,3482.9594999999999,null,null,null,null,822,40331.752999999997,null,823,13481.449999999999]
[null,null,824,43814.712499999994,null,null,824,3482.9594999999999,null,null,null,null,823,40331.752999999997,null,824,13481.449999999999]
[null,null,825,43814.712499999994,null,null,825,3482.9594999999999,null,null,null,null,824,40331.752999999997,null,825,13481.449999999999]
[null,null,826,43814.712499999994,null,null,826,3482.9594999999999,null,null,null,null,825,40331.752999999997,null,826,13481.449999999999]
[null,null,827,43814.712499999994,null,null,827,3482.9594999999999,null,null,null,null,826,40331.752999999997,null,827,13481.449999999999]
[null,null,828,43814.712499999994,null,null,828,3482.9594999999999,null,null,null,null,827,40331.752999999997,null,828,13481.449999999999]
[null,null,829,43814.712499999994,null,null,829,3482.9594999999999,null,null,null,null,828,40331.752999999997,null,829,13481.449999999999]
[null,null,830,43814.712499999994,null,null,830,3482.9594999999999,null,null,null,null,829,40331.752999999997,null,830,13481.449999999999]
[null,null,831,43814.712499999994,null,null,831,3482.9594999999999,null,null,null,null,830,40331.752999999997,null,831,13481.449999999999]
[null,null,832,43814.712499999994,null,null,832,3482.9594999999999,null,null,null,null,831,40331.752999999997,null,832,13481.449999999999]
[null,null,833,43814.712499999994,null,null,833,3482.9594999999999,null,null,null,null,832,40331.752999999997,null,833,13481.449999999999]
[null,null,834,43814.712499999994,null,null,834,3482.9594999999999,null,null,null,null,833,40331.752999999997,null,834,13481.449999999999]
[null,null,835,43814.712499999994,null,null,835,3482.9594999999999,null,null,null,null,834,40331.752999999997,null,835,13481.449999999999]
[null,null,836,43814.712499999994,null,null,836,3482.9594999999999,null,null,null,null,835,40331.752999999997,null,836,13481.449999999999]
[null,null,837,43814.712499999994,null,null,837,3482.9594999999999,null,null,null,null,836,40331.752999999997,null,837,13481.449999999999]
[null,null,838,43814.712499999994,null,null,838,3482.9594999999999,null,null,null,null,837,40331.752999999997,null,838,13481.449999999999]
[null,null,839,43814.712499999994,null,null,839,3482.9594999999999,null,null,null,null,838,40331.752999999997,null,839,13481.449999999999]
[null,null,840,43814.712499999994,null,null,840,3482.9594999999999,null,null,null,null,839,40331.752999999997,null,840,13481.449999999999]
[null,null,841,43814.712499999994,null,null,841,3482.9594999999999,null,null,null,null,840,40331.752999999997,null,841,13481.449999999999]
[null,null,842,43814.712499999994,null,null,842,3482.9594999999999,null,null,null,null,841,40331.752999999997,null,842,13481.449999999999]
[null,null,843,43814.712499999994,null,null,843,3482.9594999999999,null,null,null,null,842,40331.752999999997,null,843,13481.449999999999]
[null,null,844,43814.712499999994,null,null,844,3482.9594999999999,null,null,null,null,843,40331.752999999997,null,844,13481.449999999999]
[null,null,845,43814.712499999994,null,null,845,3482.9594999999999,null,null,null,null,844,40331.752999999997,null,845,13481.449999999999]
[null,null,846,43814.712499999994,null,null,846,3482.9594999999999,null,null,null,null,845,40331.752999999997,null,846,13481.449999999999]
[null,null,847,43814.712499999994,null,null,847,3482.9594999999999,null,null,null,null,846,40331.752999999997,null,847,13481.449999999999]
[null,null,848,43814.712499999994,null,null,848,3482.9594999999999,null,null,null,null,847,40331.752999999997,null,848,13481.449999999999]
[null,null,849,43814.712499999994,null,null,849,3482.9594999999999,null,null,null,null,848,40331.752999999997,null,849,13481.449999999999]
[null,null,850,43814.712499999994,null,null,850,3482.9594999999999,null,null,null,null,849,40331.752999999997,null,850,13481.449999999999]
[null,null,851,43814.712499999994,null,null,851,3482.9594999999999,null,null,null,null,850,40331.752999999997,null,851,13481.449999999999]
[null,null,852,43814.712499999994,null,null,852,3482.9594999999999,null,null,null,null,851,40331.752999999997,null,852,13481.449999999999]
[null,null,853,43814.712499999994,null,null,853,3482.9594999999999,null,null,null,null,852,40331.752999999997,null,853,13481.449999999999]
[null,null,854,43814.712499999994,null,null,854,3482.9594999999999,null,null,null,null,853,40331.752999999997,null,854,13481.449999999999]
[null,null,855,43814.712499999994,null,null,855,3482.9594999999999,null,null,null,null,854,40331.752999999997,null,855,13481.449999999999]
[null,null,856,43814.712499999994,null,null,856,3482.9594999999999,null,null,null,null,855,40331.752999999997,null,856,13481.449999999999]
[null,null,857,43814.712499999994,null,null,857,3482.9594999999999,null,null,null,null,856,40331.752999999997,null,857,13481.449999999999]
[null,null,858,43814.712499999994,null,null,858,3482.9594999999999,null,null,null,null,857,40331.752999999997,null,858,13481.449999999999]
[null,null,859,43814.712499999994,null,null,859,3482.9594999999999,null,null,null,null,858,40331.752999999997,null,859,13481.449999999999]
[null,null,860,43814.712499999994,null,null,860,3482.9594999999999,null,null,null,null,859,40331.752999999997,null,860,13481.449999999999]
[null,null,861,43814.712499999994,null,null,861,3482.9594999999999,null,null,null,null,860,40331.752999999997,null,861,13481.449999999999]
[null,null,862,43814.712499999994,null,null,862,3482.9594999999999,null,null,null,null,861,40331.752999999997,null,862,13481.449999999999]
[null,null,863,43814.712499999994,null,null,863,3482.9594999999999,null,null,null,null,862,40331.752999999997,null,863,13481.449999999999]
[null,null,864,43814.712499999994,null,null,864,3482.9594999999999,null,null,null,null,863,40331.752999999997,null,864,13481.449999999999]
[null,null,865,43814.712499999994,null,null,865,3482.9594999999999,null,null,null,null,864,40331.752999999997,null,865,13481.449999999999]
[null,null,866,43814.712499999994,null,null,866,3482.9594999999999,null,null,null,null,865,40331.752999999997,null,866,13481.449999999999]
[null,null,867,43814.712499999994,null,null,867,3482.9594999999999,null,null,null,null,866,40331.752999999997,null,867,13481.449999999999]
[null,null,868,43814.712499999994,null,null,868,3482.9594999999999,null,null,null,null,867,40331.752999999997,null,868,13481.449999999999]
[null,null,869,43814.712499999994,null,null,869,3482.9594999999999,null,null,null,null,868,40331.752999999997,null,869,13481.449999999999]
[null,null,870,43814.712499999994,null,null,870,3482.9594999999999,null,null,null,null,869,40331.752999999997,null,870,13481.449999999999]
[null,null,871,43814.712499999994,null,null,871,3482.9594999999999,null,null,null,null,870,40331.752999999997,null,871,13481.449999999999]
[null,null,872,43814.712499999994,null,null,872,3482.9594999999999,null,null,null,null,871,40331.752999999997,null,872,13481.449999999999]
[null,null,873,43814.712499999994,null,null,873,3482.9594999999999,null,null,null,null,872,40331.752999999997,null,873,13481.449999999999]
[null,null,874,43814.712499999994,null,null,874,3482.9594999999999,null,null,null,null,873,40331.752999999997,null,874,13481.449999999999]
[null,null,875,43814.712499999994,null,null,875,3482.9594999999999,null,null,null,null,874,40331.752999999997,null,875,13481.449999999999]
[null,null,876,43814.712499999994,null,null,876,3482.9594999999999,null,null,null,null,875,40331.752999999997,null,876,13481.449999999999]
[null,null,877,43814.712499999994,null,null,877,3482.9594999999999,null,null,null,null,876,40331.752999999997,null,877,13481.449999999999]
[null,null,878,43814.712499999994,null,null,878,3482.9594999999999,null,null,null,null,877,40331.752999999997,null,878,13481.449999999999]
[null,null,879,43814.712499999994,null,null,879,3482.9594999999999,null,null,null,null,878,40331.752999999997,null,879,13481.449999999999]
[null,null,880,43814.712499999994,null,null,880,3482.9594999999999,null,null,null,null,879,40331.752999999997,null,880,13481.449999999999]
[null,null,881,43814.712499999994,null,null,881,3482.9594999999999,null,null,null,null,880,40331.752999999997,null,881,13481.449999999999]
[null,null,882,43814.712499999994,null,null,882,3482.9594999999999,null,null,null,null,881,40331.752999999997,null,882,13481.449999999999]
[null,null,883,43814.712499999994,null,null,883,3482.9594999999999,null,null,null,null,882,40331.752999999997,null,883,13481.449999999999]
[null,null,884,43814.712499999994,null,null,884,3482.9594999999999,null,null,null,null,883,40331.752999999997,null,884,13481.449999999999]
[null,null,885,43814.712499999994,null,null,885,3482.9594999999999,null,null,null,null,884,40331.752999999997,null,885,13481.449999999999]
[null,null,886,43814.712499999994,null,null,886,3482.9594999999999,null,null,null,null,885,40331.752999999997,null,886,13481.449999999999]
[null,null,887,43814.712499999994,null,null,887,3482.9594999999999,null,null,null,null,886,40331.752999999997,null,887,13481.449999999999]
[null,null,888,43814.712499999994,null,null,888,3482.9594999999999,null,null,null,null,887,40331.752999999997,null,888,13481.449999999999]
[null,null,889,43814.712499999994,null,null,889,3482.9594999999999,null,null,null,null,888,40331.752999999997,null,889,13481.449999999999]
[null,null,890,43814.712499999994,null,null,890,3482.9594999999999,null,null,null,null,889,40331.752999999997,null,890,13481.449999999999]
[null,null,891,43814.712499999994,null,null,891,3482.9594999999999,null,null,null,null,890,40331.752999999997,null,891,13481.449999999999]
[null,null,892,43814.712499999994,null,null,892,3482.9594999999999,null,null,null,null,891,40331.752999999997,null,892,13481.449999999999]
[null,null,893,43814.712499999994,null,null,893,3482.9594999999999,null,null,null,null,892,40331.752999999997,null,893,13481.449999999999]
[null,null,894,43814.712499999994,null,null,894,3482.9594999999999,null,null,null,null,893,40331.752999999997,null,894,13481.449999999999]
[null,null,895,43814.712499999994,null,null,895,3482.9594999999999,null,null,null,null,894,40331.752999999997,null,895,13481.449999999999]
[null,null,896,43814.712499999994,null,null,896,3482.9594999999999,null,null,null,null,895,40331.752999999997,null,896,13481.449999999999]
[null,null,897,43814.712499999994,null,null,897,3482.9594999999999,null,null,null,null,896,40331.752999999997,null,897,13481.449999999999]
[null,null,898,43814.712499999994,null,null,898,3482.9594999999999,null,null,null,null,897,40331.752999999997,null,898,13481.449999999999]
[null,null,899,43814.712499999994,null,null,899,3482.9594999999999,null,null,null,null,898,40331.752999999997,null,899,13481.449999999999]
[null,null,900,43814.712499999994,null,null,900,3482.9594999999999,null,null,null,null,899,40331.752999999997,null,900,13481.449999999999]
[null,null,901,43814.712499999994,null,null,901,3482.9594999999999,null,null,null,null,900,40331.752999999997,null,901,13481.449999999999]
[null,null,902,43814.712499999994,null,null,902,3482.9594999999999,null,null,null,null,901,40331.752999999997,null,902,13481.449999999999]
[null,null,903,43814.712499999994,null,null,903,3482.9594999999999,null,null,null,null,902,40331.752999999997,null,903,13481.449999999999]
[null,null,904,43814.712499999994,null,null,904,3482.9594999999999,null,null,null,null,903,40331.752999999997,null,904,13481.449999999999]
[null,null,905,43814.712499999994,null,null,905,3482.9594999999999,null,null,null,null,904,40331.752999999997,null,905,13481.449999999999]
[null,null,906,43814.712499999994,null,null,906,3482.9594999999999,null,null,null,null,905,40331.752999999997,null,906,13481.449999999999]
[null,null,907,43814.712499999994,null,null,907,3482.9594999999999,null,null,null,null,906,40331.752999999997,null,907,13481.449999999999]
[null,null,908,43814.712499999994,null,null,908,3482.9594999999999,null,null,null,null,907,40331.752999999997,null,908,13481.449999999999]
[null,null,909,43814.712499999994,null,null,909,3482.9594999999999,null,null,null,null,908,40331.752999999997,null,909,13481.449999999999]
[null,null,910,43814.712499999994,null,null,910,3482.9594999999999,null,null,null,null,909,40331.752999999997,null,910,13481.449999999999]
[null,null,911,43814.712499999994,null,null,911,3482.9594999999999,null,null,null,null,910,40331.752999999997,null,911,13481.449999999999]
[null,null,912,43814.712499999994,null,null,912,3482.9594999999999,null,null,null,null,911,40331.752999999997,null,912,13481.449999999999]
[null,null,913,43814.712499999994,null,null,913,3482.9594999999999,null,null,null,null,912,40331.752999999997,null,913,13481.449999999999]
[null,null,914,43814.712499999994,null,null,914,3482.9594999999999,null,null,null,null,913,40331.752999999997,null,914,13481.449999999999]
[null,null,915,43814.712499999994,null,null,915,3482.9594999999999,null,null,null,null,914,40331.752999999997,null,915,13481.449999999999]
[null,null,916,43814.712499999994,null,null,916,3482.9594999999999,null,null,null,null,915,40331.752999999997,null,916,13481.449999999999]
[null,null,917,43814.712499999994,null,null,917,3482.9594999999999,null,null,null,null,916,40331.752999999997,null,917,13481.449999999999]
[null,null,918,43814.712499999994,null,null,918,3482.9594999999999,null,null,null,null,917,40331.752999999997,null,918,13481.449999999999]
[null,null,919,43814.712499999994,null,null,919,3482.9594999999999,null,null,null,null,918,40331.752999999997,null,919,13481.449999999999]
[null,null,920,43814.712499999994,null,null,920,3482.9594999999999,null,null,null,null,919,40331.752999999997,null,920,13481.449999999999]
[null,null,921,43814.712499999994,null,null,921,3482.9594999999999,null,null,null,null,920,40331.752999999997,null,921,13481.449999999999]
[null,null,922,43814.712499999994,null,null,922,3482.9594999999999,null,null,null,null,921,40331.752999999997,null,922,13481.449999999999]
[null,null,923,43814.712499999994,null,null,923,3482.9594999999999,null,null,null,null,922,40331.752999999997,null,923,13481.449999999999]
[null,null,924,43814.712499999994,null,null,924,3482.9594999999999,null,null,null,null,923,40331.752999999997,null,924,13481.449999999999]
[null,null,925,43814.712499999994,null,null,925,3482.9594999999999,null,null,null,null,924,40331.752999999997,null,925,13481.449999999999]
[null,null,926,43814.712499999994,null,null,926,3482.9594999999999,null,null,null,null,925,40331.752999999997,null,926,13481.449999999999]
[null,null,927,43814.712499999994,null,null,927,3482.9594999999999,null,null,null,null,926,40331.752999999997,null,927,13481.449999999999]
[null,null,928,43814.712499999994,null,null,928,3482.9594999999999,null,null,null,null,927,40331.752999999997,null,928,13481.449999999999]
[null,null,929,43814.712499999994,null,null,929,3482.9594999999999,null,null,null,null,928,40331.752999999997,null,929,13481.449999999999]
[null,null,930,43814.712499999994,null,null,930,3482.9594999999999,null,null,null,null,929,40331.752999999997,null,930,13481.449999999999]
[null,null,931,43814.712499999994,null,null,931,3482.9594999999999,null,null,null,null,930,40331.752999999997,null,931,13481.449999999999]
[null,null,932,43814.712499999994,null,null,932,3482.9594999999999,null,null,null,null,931,40331.752999999997,null,932,13481.449999999999]
[null,null,933,43814.712499999994,null,null,933,3482.9594999999999,null,null,null,null,932,40331.752999999997,null,933,13481.449999999999]
[null,null,934,43814.712499999994,null,null,934,3482.9594999999999,null,null,null,null,933,40331.752999999997,null,934,13481.449999999999]
[null,null,935,43814.712499999994,null,null,935,3482.9594999999999,null,null,null,null,934,40331.752999999997,null,935,13481.449999999999]
[null,null,936,43814.712499999994,null,null,936,3482.9594999999999,null,null,null,null,935,40331.752999999997,null,936,13481.449999999999]
[null,null,937,43814.712499999994,null,null,937,3482.9594999999999,null,null,null,null,936,40331.752999999997,null,937,13481.449999999999]
[null,null,938,43814.712499999994,null,null,938,3482.9594999999999,null,null,null,null,937,40331.752999999997,null,938,13481.449999999999]
[null,null,939,43814.712499999994,null,null,939,3482.9594999999999,null,null,null,null,938,40331.752999999997,null,939,13481.449999999999]
[null,null,940,43814.712499999994,null,null,940,3482.9594999999999,null,null,null,null,939,40331.752999999997,null,940,13481.449999999999]
[null,null,941,43814.712499999994,null,null,941,3482.9594999999999,null,null,null,null,940,40331.752999999997,null,941,13481.449999999999]
[null,null,942,43814.712499999994,null,null,942,3482.9594999999999,null,null,null,null,941,40331.752999999997,null,942,13481.449999999999]
[null,null,943,43814.712499999994,null,null,943,3482.9594999999999,null,null,null,null,942,40331.752999999997,null,943,13481.449999999999]
[null,null,944,43814.712499999994,null,null,944,3482.9594999999999,null,null,null,null,943,40331.752999999997,null,944,13481.449999999999]
[null,null,945,43814.712499999994,null,null,945,3482.9594999999999,null,null,null,null,944,40331.752999999997,null,945,13481.449999999999]
[null,null,946,43814.712499999994,null,null,946,3482.9594999999999,null,null,null,null,945,40331.752999999997,null,946,13481.449999999999]
[null,null,947,43814.712499999994,null,null,947,3482.9594999999999,null,null,null,null,946,40331.752999999997,null,947,13481.449999999999]
[null,null,948,43814.712499999994,null,null,948,3482.9594999999999,null,null,null,null,947,40331.752999999997,null,948,13481.449999999999]
[null,null,949,43814.712499999994,null,null,949,3482.9594999999999,null,null,null,null,948,40331.752999999997,null,949,13481.449999999999]
[null,null,950,43814.712499999994,null,null,950,3482.9594999999999,null,null,null,null,949,40331.752999999997,null,950,13481.449999999999]
[null,null,951,43814.712499999994,null,null,951,3482.9594999999999,null,null,null,null,950,40331.752999999997,null,951,13481.449999999999]
[null,null,952,43814.712499999994,null,null,952,3482.9594999999999,null,null,null,null,951,40331.752999999997,null,952,13481.449999999999]
[null,null,953,43814.712499999994,null,null,953,3482.9594999999999,null,null,null,null,952,40331.752999999997,null,953,13481.449999999999]
[null,null,954,43814.712499999994,null,null,954,3482.9594999999999,null,null,null,null,953,40331.752999999997,null,954,13481.449999999999]
[null,null,955,43814.712499999994,null,null,955,3482.9594999999999,null,null,null,null,954,40331.752999999997,null,955,13481.449999999999]
[null,null,956,43814.712499999994,null,null,956,3482.9594999999999,null,null,null,null,955,40331.752999999997,null,956,13481.449999999999]
[null,null,957,43814.712499999994,null,null,957,3482.9594999999999,null,null,null,null,956,40331.752999999997,null,957,13481.449999999999]
[null,null,958,43814.712499999994,null,null,958,3482.9594999999999,null,null,null,null,957,40331.752999999997,null,958,13481.449999999999]
[null,null,959,43814.712499999994,null,null,959,3482.9594999999999,null,null,null,null,958,40331.752999999997,null,959,13481.449999999999]
[null,null,960,43814.712499999994,null,null,960,3482.9594999999999,null,null,null,null,959,40331.752999999997,null,960,13481.449999999999]
[null,null,961,43814.712499999994,null,null,961,3482.9594999999999,null,null,null,null,960,40331.752999999997,null,961,13481.449999999999]
[null,null,962,43814.712499999994,null,null,962,3482.9594999999999,null,null,null,null,961,40331.752999999997,null,962,13481.449999999999]
[null,null,963,43814.712499999994,null,null,963,3482.9594999999999,null,null,null,null,962,40331.752999999997,null,963,13481.449999999999]
[null,null,964,43814.712499999994,null,null,964,3482.9594999999999,null,null,null,null,963,40331.752999999997,null,964,13481.449999999999]
[null,null,965,43814.712499999994,null,null,965,3482.9594999999999,null,null,null,null,964,40331.752999999997,null,965,13481.449999999999]
[null,null,966,43814.712499999994,null,null,966,3482.9594999999999,null,null,null,null,965,40331.752999999997,null,966,13481.449999999999]
[null,null,967,43814.712499999994,null,null,967,3482.9594999999999,null,null,null,null,966,40331.752999999997,null,967,13481.449999999999]
[null,null,968,43814.712499999994,null,null,968,3482.9594999999999,null,null,null,null,967,40331.752999999997,null,968,13481.449999999999]
[null,null,969,43814.712499999994,null,null,969,3482.9594999999999,null,null,null,null,968,40331.752999999997,null,969,13481.449999999999]
[null,null,970,43814.712499999994,null,null,970,3482.9594999999999,null,null,null,null,969,40331.752999999997,null,970,13481.449999999999]
[null,null,971,43814.712499999994,null,null,971,3482.9594999999999,null,null,null,null,970,40331.752999999997,null,971,13481.449999999999]
[null,null,972,43814.712499999994,null,null,972,3482.9594999999999,null,null,null,null,971,40331.752999999997,null,972,13481.449999999999]
[null,null,973,43814.712499999994,null,null,973,3482.9594999999999,null,null,null,null,972,40331.752999999997,null,973,13481.449999999999]
[null,null,974,43814.712499999994,null,null,974,3482.9594999999999,null,null,null,null,973,40331.752999999997,null,974,13481.449999999999]
[null,null,975,43814.712499999994,null,null,975,3482.9594999999999,null,null,null,null,974,40331.752999999997,null,975,13481.449999999999]
[null,null,976,43814.712499999994,null,null,976,3482.9594999999999,null,null,null,null,975,40331.752999999997,null,976,13481.449999999999]
[null,null,977,43814.712499999994,null,null,977,3482.9594999999999,null,null,null,null,976,40331.752999999997,null,977,13481.449999999999]
[null,null,978,43814.712499999994,null,null,978,3482.9594999999999,null,null,null,null,977,40331.752999999997,null,978,13481.449999999999]
[null,null,979,43814.712499999994,null,null,979,3482.9594999999999,null,null,null,null,978,40331.752999999997,null,979,13481.449999999999]
[null,null,980,43814.712499999994,null,null,980,3482.9594999999999,null,null,null,null,979,40331.752999999997,null,980,13481.449999999999]
[null,null,981,43814.712499999994,null,null,981,3482.9594999999999,null,null,null,null,980,40331.752999999997,null,981,13481.449999999999]
[null,null,982,43814.712499999994,null,null,982,3482.9594999999999,null,null,null,null,981,40331.752999999997,null,982,13481.449999999999]
[null,null,983,43814.712499999994,null,null,983,3482.9594999999999,null,null,null,null,982,40331.752999999997,null,983,13481.449999999999]
[null,null,984,43814.712499999994,null,null,984,3482.9594999999999,null,null,null,null,983,40331.752999999997,null,984,13481.449999999999]
[null,null,985,43814.712499999994,null,null,985,3482.9594999999999,null,null,null,null,984,40331.752999999997,null,985,13481.449999999999]
[null,null,986,43814.712499999994,null,null,986,3482.9594999999999,null,null,null,null,985,40331.752999999997,null,986,13481.449999999999]
[null,null,987,43814.712499999994,null,null,987,3482.9594999999999,null,null,null,null,986,40331.752999999997,null,987,13481.449999999999]
[null,null,988,43814.712499999994,null,null,988,3482.9594999999999,null,null,null,null,987,40331.752999999997,null,988,13481.449999999999]
[null,null,989,43814.712499999994,null,null,989,3482.9594999999999,null,null,null,null,988,40331.752999999997,null,989,13481.449999999999]
[null,null,990,43814.712499999994,null,null,990,3482.9594999999999,null,null,null,null,989,40331.752999999997,null,990,13481.449999999999]
[null,null,991,43814.712499999994,null,null,991,3482.9594999999999,null,null,null,null,990,40331.752999999997,null,991,13481.449999999999]
[null,null,992,43814.712499999994,null,null,992,3482.9594999999999,null,null,null,null,991,40331.752999999997,null,992,13481.449999999999]
[null,null,993,43814.712499999994,null,null,993,3482.9594999999999,null,null,null,null,992,40331.752999999997,null,993,13481.449999999999]
[null,null,994,43814.712499999994,null,null,994,3482.9594999999999,null,null,null,null,993,40331.752999999997,null,994,13481.449999999999]
[null,null,995,43814.712499999994,null,null,995,3482.9594999999999,null,null,null,null,994,40331.752999999997,null,995,13481.449999999999]
[null,null,996,43814.712499999994,null,null,996,3482.9594999999999,null,null,null,null,995,40331.752999999997,null,996,13481.449999999999]
[null,null,997,43814.712499999994,null,null,997,3482.9594999999999,null,null,null,null,996,40331.752999999997,null,997,13481.449999999999]
[null,null,998,43814.712499999994,null,null,998,3482.9594999999999,null,null,null,null,997,40331.752999999997,null,998,13481.449999999999]
[null,null,999,43814.712499999994,null,null,999,3482.9594999999999,null,null,null,null,998,40331.752999999997,null,999,13481.449999999999]
[null,null,1000,43814.712499999994,null,null,1000,3482.9594999999999,null,null,null,null,999,40331.752999999997,null,1000,13481.449999999999]
[null,null,null,null,null,null,null,null,null,null,null,null,1000,40331.752999999997]

{"sheet":"Mug Discount Calc","index":7,"n_rows":1036,"n_cols":17,"rows_kept":1036,"cut":false,"hidden":false,"merged":[[0,0,0,9],[15,7,15,8]]}
["Mug Discount Data"]
[null,null,null,null,null,null,null,null,null,null,null,"Type","Hot drink"]
[null,"Percent of Customers That Bring Mugs",null,null,null,null,null,null,null,null,null,"To Go?","1"]
[null,{"$f":"IF(C6=0,0.1,RANDBETWEEN(10,15)/100)","v":0.1}]
[null,null,null,null,"Discount",{"$f":"(I9-I11)/I9","v":9.2307692307692257E-2},null,"Cost Per Cup:",0.05,null,null,"Row Labels","Sum of Qty"]
[null,null,{"$f":"IF('Mug Discount'!J4=\"Static\",0,1)","v":0},null,null,null,null,null,null,null,null,"2013",2176]
[null,null,null,null,null,null,null,"Investment in Advertising:",{"$f":"LandfillDiversion!M3","v":2000},null,null,"2014",5200]
[null,null,null,null,null,null,null,null,null,null,null,"2015",7971]
[null,null,"Probability"," % customer increase",null,null,null,"Regular Sales Price: ",{"$f":"LandfillDiversion!M5","v":3.25},null,null,"2016",11723]
[null,0,0.25,0.1,null,{"$f":"H9&DOLLAR(I9)","v":"Regular Sales Price: $3.25"},null,null,null,null,null,"2017",10155]
[null,{"$f":"C10+B10","v":0.25},0.4,0.15,null,null,null,"Discounted Sales Price: ",{"$f":"I12/100","v":2.95},null,null,"Grand Total",37225]
[null,{"$f":"C11+B11","v":0.65},0.25,0.2,null,{"$f":"H11&DOLLAR(I11)","v":"Discounted Sales Price: $2.95"},null,null,295]
[null,0.9,0.1,0.3,null,null,null,null,null,null,null,"Type","Hot drink"]
[null,null,null,null,null,"Weight in Landfill",{"$f":"(E20*Avg._Weight__g__of_Coffee_Cup)/453.592","v":294.23578899098749},null,{"$f":"DOLLAR(I7,0)&\" of this cost comes from advertising expenses\"","v":"$2,000 of this cost comes from advertising expenses"},null,null,"To Go?","1"]
[null,"2016 Demand",null,null,null,null,{"$f":"ROUND(G14,2)&\" pounds are still discarded in landfills.\"","v":"294.24 pounds are still discarded in landfills."},null,null,null,null,"Date (Year)","2016"]
[null,11723,{"$f":"0.15*_2016_Demand","v":1758.45},null,null,{"$f":"'Mug Discount Calc'!F31","v":"Bottom Line Change:"},null,"Landfill Data"]
[null,"New Customer Base Multiplier","New Customer Base","Mugs Used as an Alternative","Disposable Cups Used by Customer",null,null,"Avg. Weight (g) of Coffee Cup",11,null,null,"Row Labels","Sum of Transaction Revenue","Sum of Qty"]
[null,{"$f":"IF(C6=0,0.15,VLOOKUP(RAND(),B10:D13,3,TRUE))","v":0.15},{"$f":"GETPIVOTDATA(\"[Measures].[Sum of Qty]\",$L$5,\"[transdetails].[Date (Year)]\",\"[transdetails].[Date (Year)].&[2016]\")*(1+B18)","v":13481.449999999999},{"$f":"C18*B4","v":1348.145},{"$f":"C18-D18","v":12133.304999999998},null,null,"Diverted from Landfill (lbs)",{"$f":"(Avg._Weight__g__of_Coffee_Cup*D20)/453.592","v":32.69017090248505},null,null,"Aeropress-8 oz",1280,320]
[null,{"$f":"\"Percent Customer Increase:\"","v":"Percent Customer Increase:"},{"$f":"IF(Skew_Customer>1,\"New Customer Demand Median:\", \"New Customer Demand Average:\")","v":"New Customer Demand Median:"},"Mugs Used","Disposable Cups Used",null,null,{"$f":"\"- \"&TEXT(ROUND(I19,0),\"#,#\")&\" Ping-Pong Balls\"","v":"- 5,492 Ping-Pong Balls"},{"$f":"I18/0.00595248","v":5491.8573271115656},null,null,"Americano-8 oz",270.75,57]
[null,{"$f":"IF(C6=0,0.15,(C20-_2016_Demand)/_2016_Demand)","v":0.15},{"$f":"IF(C6=0,(_2016_Demand+C16),IF(Skew_Customer>1,MEDIAN(F37:F1036),AVERAGE(F37:F1036)))","v":13481.45},{"$f":"ROUND(B4*C20,0)","v":1348},{"$f":"ROUND((1-B4)*C20,0)","v":12133},null,null,{"$f":"\"- \"&TEXT(ROUND(I20,0),\"#,#\")&\" iPhone 8 Devices\"","v":"- 100 iPhone 8 Devices"},{"$f":"I18/0.32625","v":100.19975755550973},null,null,"Café Cubano-2 oz",2156,616]
[null,null,{"$f":"\"+\"&TEXT(C20-_2016_Demand,\"#,#.00\")","v":"+1,758.45"},"Costs if no one brought a mug",null,null,null,{"$f":"\"- \"&TEXT(ROUND(I21,0),\"#,#\")&\" U.S. Quarters (That's Equal to \"&TEXT(ROUND(I21,1)*0.25,\"$0.00\")&\")\"","v":"- 2,615 U.S. Quarters (That's Equal to $653.80)"},{"$f":"I18/0.01250021","v":2615.1697373472166},null,null,"Café latté-10 oz",6753.75,1801]
[null,null,null,{"$f":"C20*I5","v":674.0725000000001},null,null,null,null,null,null,null,"Café latté-12 oz",221,52]
[null,null,"Revenue from Mug Customers","Revenue from Regular Customers","Cost of Disposible Cups","Advertising Cost",null,"Old Profit",40818.1,null,null,"Cappuccino-6 oz",4443.75,1185]
[null,null,{"$f":"D18*I11","v":3977.0277500000002},{"$f":"E18*I9","v":39433.241249999992},{"$f":"E20*I5","v":606.65},{"$f":"I7","v":2000},null,"New Profit After Mug Discount:",{"$f":"E26-(E24+F24)","v":40803.619999999995},null,null,"Chai-10 oz",1404,351]
[null,null,{"$f":"IF(Skew_RevenueDis>1,\"Total Revenue from Mug Customers Median:\", \"Total Revenue from Mug Customers Average:\")","v":"Total Revenue from Mug Customers Median:"},{"$f":"IF(Skew_RevenueReg>1,\"Total Revenue from Regular Customers Median:\", \"Total Revenue from Regular Customers Average:\")","v":"Total Revenue from Regular Customers Average:"},"New Annual Revenue: ",null,null,"Mug Discounts Will Lead to a ",{"$f":"IF(I26>0,\"Profit Gain of:\",\"Profit Loss of:\")","v":"Profit Loss of:"},null,null,"Chai-12 oz",399,84]
[null,null,{"$f":"DOLLAR(IF(Skew_RevenueDis>1,MEDIAN(B37:B1036),AVERAGE(B37:B1036)))","v":"$3,977.03"},{"$f":"DOLLAR(IF(Skew_RevenueReg>1,MEDIAN(D37:D1036),AVERAGE(D37:D1036)))","v":"$39,433.24"},{"$f":"DOLLAR(D26+C26)","v":"$43,410.27"},null,null,{"$f":"H25&I25","v":"Mug Discounts Will Lead to a Profit Loss of:"},{"$f":"I24-I23","v":-14.480000000003201},null,null,"Cortado-4 oz",82.5,22]
[null,null,{"$f":"IF(Skew_RevenueDis>1,\"Median\",\"Average\")","v":"Median"},{"$f":"IF(Skew_RevenueReg>1,\"Median\",\"Average\")","v":"Average"},{"$f":"SKEW(H37:H1036)","v":-1.001502880698883},{"$f":"MEDIAN(H37:H1036)","v":43410.268999999993},null,null,null,null,null,"Drip coffee-10 oz",1197,684]
[null,null,"Where Revenue Comes From","Revenue From Current Situation","Cost From Current Situation",null,null,"Positive:",{"$f":"IF(I26>0,DOLLAR(I26,2),\"\")","v":""},null,null,"Drip coffee-16 oz",445.5,162,null,null,"Total revenue"]
[null,"Total Revenue From Mug Customers",{"$f":"VALUE(C26)","v":3977.03},{"$f":"'Descriptive Model'!E7","v":41404.25},{"$f":"'Descriptive Model'!G4","v":586.15},{"$f":"E24-E29","v":20.5},{"$f":"IF(F29>0,\" increase\",\" decrease\")","v":" increase"},"Negative:",{"$f":"IF(I26<0,DOLLAR(I26,2),\"\")","v":"($14.48)"},null,null,"Espresso-1 oz",497.5,199,null,"Total Revenue from Mug Customers Median:"]
[null,"Total Revenue From Regular Customers",{"$f":"VALUE(D26)","v":39433.24},null,null,{"$f":"IF(G29=\" decrease\",-F29,F29)","v":20.5},{"$f":"\"This is a \"&DOLLAR(F30,2)&G29&\" in total annual disposable cup costs, since \"&DOLLAR(I7,0)&\" comes from advertising costs\"","v":"This is a $20.50 increase in total annual disposable cup costs, since $2,000 comes from advertising costs"},null,null,null,null,"Hot chocolate-Kid's (8 oz)",113.75,35,null,"Total Revenue from Regular Customers Average:","$39,433.24"]
[null,null,"Change In Cost Since Last Year","Revenue Gains","Cost Increases:","Bottom Line Change:",{"$f":"\"This is a \"&DOLLAR(F30,2)&G29&\" in costs associated with disposable cups\"","v":"This is a $20.50 increase in costs associated with disposable cups"},null,null,null,null,"Hot chocolate-Regular (12 oz)",935.75,197,null,null,"$3,977.03"]
[null,"2016 Disposable Cup Costs",{"$f":"VALUE(E29)","v":586.15},{"$f":"(C26+D26)-D29","v":2006.0199999999968},{"$f":"(E24+F24)-E29","v":2020.5},{"$f":"D32-E32","v":-14.480000000003201},null,null,null,null,null,"Moroccan tea-10 oz",1155,385]
[null,"2017 Disposable Cup Costs",{"$f":"VALUE(E24)","v":606.65},null,null,null,null,null,null,{"$f":"J34&DOLLAR(J35,2)","v":"Profit Standard Deviation:  +/- $0.00"},null,"Pourover-10 oz",6333,2111]
["Skew RevenueDis",{"$f":"SKEW(B37:B1036)","v":1.001502880698883},"Skew RevenueReg",{"$f":"SKEW(D37:D1036)","v":-1.001502880698883},"Skew Customer",{"$f":"SKEW(F37:F1036)","v":1.001502880698883},null,{"$f":"\"Revenue Standard Deviation is +/- \"&DOLLAR(_xlfn.STDEV.S(H37:H1036),2)","v":"Revenue Standard Deviation is +/- $0.00"},null,"Profit Standard Deviation:  +/- ",null,"Pourover-12 oz",5071.5,1449]
[null,{"$f":"C23","v":"Revenue from Mug Customers"},null,{"$f":"D23","v":"Revenue from Regular Customers"},null,{"$f":"C17","v":"New Customer Base"},null,"Total Revenue Monte Carlo",null,{"$f":"_xlfn.STDEV.S(J37:J1036)","v":1.8926955641750914E-10},null,"Rooibos latté-12 oz",2293.5,417]
[null,{"$f":"C24","v":3977.0277500000002},null,{"$f":"D24","v":39433.241249999992},null,{"$f":"C18","v":13481.449999999999},null,{"$f":"B36+D36","v":43410.268999999993},null,{"$f":"I24","v":40803.619999999995},null,"Rooibos latté-8 oz",876.75,167]
[1,3977.0277500000002,1,39433.241249999992,1,13481.449999999999,1,43410.268999999993,1,40803.619999999995,null,"Sahlep-6 oz",632,158]
[2,3977.0277500000002,2,39433.241249999992,2,13481.449999999999,2,43410.268999999993,2,40803.619999999995,null,"Turkish coffee-3 oz",4481.25,1195]
[3,3977.0277500000002,3,39433.241249999992,3,13481.449999999999,3,43410.268999999993,3,40803.619999999995,null,"Vacuum brew-12 oz",361,76]
[4,3977.0277500000002,4,39433.241249999992,4,13481.449999999999,4,43410.268999999993,4,40803.619999999995,null,"Grand Total",41404.25,11723]
[5,3977.0277500000002,5,39433.241249999992,5,13481.449999999999,5,43410.268999999993,5,40803.619999999995]
[6,3977.0277500000002,6,39433.241249999992,6,13481.449999999999,6,43410.268999999993,6,40803.619999999995]
[7,3977.0277500000002,7,39433.241249999992,7,13481.449999999999,7,43410.268999999993,7,40803.619999999995]
[8,3977.0277500000002,8,39433.241249999992,8,13481.449999999999,8,43410.268999999993,8,40803.619999999995]
[9,3977.0277500000002,9,39433.241249999992,9,13481.449999999999,9,43410.268999999993,9,40803.619999999995]
[10,3977.0277500000002,10,39433.241249999992,10,13481.449999999999,10,43410.268999999993,10,40803.619999999995]
[11,3977.0277500000002,11,39433.241249999992,11,13481.449999999999,11,43410.268999999993,11,40803.619999999995]
[12,3977.0277500000002,12,39433.241249999992,12,13481.449999999999,12,43410.268999999993,12,40803.619999999995]
[13,3977.0277500000002,13,39433.241249999992,13,13481.449999999999,13,43410.268999999993,13,40803.619999999995]
[14,3977.0277500000002,14,39433.241249999992,14,13481.449999999999,14,43410.268999999993,14,40803.619999999995]
[15,3977.0277500000002,15,39433.241249999992,15,13481.449999999999,15,43410.268999999993,15,40803.619999999995]
[16,3977.0277500000002,16,39433.241249999992,16,13481.449999999999,16,43410.268999999993,16,40803.619999999995]
[17,3977.0277500000002,17,39433.241249999992,17,13481.449999999999,17,43410.268999999993,17,40803.619999999995]
[18,3977.0277500000002,18,39433.241249999992,18,13481.449999999999,18,43410.268999999993,18,40803.619999999995]
[19,3977.0277500000002,19,39433.241249999992,19,13481.449999999999,19,43410.268999999993,19,40803.619999999995]
[20,3977.0277500000002,20,39433.241249999992,20,13481.449999999999,20,43410.268999999993,20,40803.619999999995]
[21,3977.0277500000002,21,39433.241249999992,21,13481.449999999999,21,43410.268999999993,21,40803.619999999995]
[22,3977.0277500000002,22,39433.241249999992,22,13481.449999999999,22,43410.268999999993,22,40803.619999999995]
[23,3977.0277500000002,23,39433.241249999992,23,13481.449999999999,23,43410.268999999993,23,40803.619999999995]
[24,3977.0277500000002,24,39433.241249999992,24,13481.449999999999,24,43410.268999999993,24,40803.619999999995]
[25,3977.0277500000002,25,39433.241249999992,25,13481.449999999999,25,43410.268999999993,25,40803.619999999995]
[26,3977.0277500000002,26,39433.241249999992,26,13481.449999999999,26,43410.268999999993,26,40803.619999999995]
[27,3977.0277500000002,27,39433.241249999992,27,13481.449999999999,27,43410.268999999993,27,40803.619999999995]
[28,3977.0277500000002,28,39433.241249999992,28,13481.449999999999,28,43410.268999999993,28,40803.619999999995]
[29,3977.0277500000002,29,39433.241249999992,29,13481.449999999999,29,43410.268999999993,29,40803.619999999995]
[30,3977.0277500000002,30,39433.241249999992,30,13481.449999999999,30,43410.268999999993,30,40803.619999999995]
[31,3977.0277500000002,31,39433.241249999992,31,13481.449999999999,31,43410.268999999993,31,40803.619999999995]
[32,3977.0277500000002,32,39433.241249999992,32,13481.449999999999,32,43410.268999999993,32,40803.619999999995]
[33,3977.0277500000002,33,39433.241249999992,33,13481.449999999999,33,43410.268999999993,33,40803.619999999995]
[34,3977.0277500000002,34,39433.241249999992,34,13481.449999999999,34,43410.268999999993,34,40803.619999999995]
[35,3977.0277500000002,35,39433.241249999992,35,13481.449999999999,35,43410.268999999993,35,40803.619999999995]
[36,3977.0277500000002,36,39433.241249999992,36,13481.449999999999,36,43410.268999999993,36,40803.619999999995]
[37,3977.0277500000002,37,39433.241249999992,37,13481.449999999999,37,43410.268999999993,37,40803.619999999995]
[38,3977.0277500000002,38,39433.241249999992,38,13481.449999999999,38,43410.268999999993,38,40803.619999999995]
[39,3977.0277500000002,39,39433.241249999992,39,13481.449999999999,39,43410.268999999993,39,40803.619999999995]
[40,3977.0277500000002,40,39433.241249999992,40,13481.449999999999,40,43410.268999999993,40,40803.619999999995]
[41,3977.0277500000002,41,39433.241249999992,41,13481.449999999999,41,43410.268999999993,41,40803.619999999995]
[42,3977.0277500000002,42,39433.241249999992,42,13481.449999999999,42,43410.268999999993,42,40803.619999999995]
[43,3977.0277500000002,43,39433.241249999992,43,13481.449999999999,43,43410.268999999993,43,40803.619999999995]
[44,3977.0277500000002,44,39433.241249999992,44,13481.449999999999,44,43410.268999999993,44,40803.619999999995]
[45,3977.0277500000002,45,39433.241249999992,45,13481.449999999999,45,43410.268999999993,45,40803.619999999995]
[46,3977.0277500000002,46,39433.241249999992,46,13481.449999999999,46,43410.268999999993,46,40803.619999999995]
[47,3977.0277500000002,47,39433.241249999992,47,13481.449999999999,47,43410.268999999993,47,40803.619999999995]
[48,3977.0277500000002,48,39433.241249999992,48,13481.449999999999,48,43410.268999999993,48,40803.619999999995]
[49,3977.0277500000002,49,39433.241249999992,49,13481.449999999999,49,43410.268999999993,49,40803.619999999995]
[50,3977.0277500000002,50,39433.241249999992,50,13481.449999999999,50,43410.268999999993,50,40803.619999999995]
[51,3977.0277500000002,51,39433.241249999992,51,13481.449999999999,51,43410.268999999993,51,40803.619999999995]
[52,3977.0277500000002,52,39433.241249999992,52,13481.449999999999,52,43410.268999999993,52,40803.619999999995]
[53,3977.0277500000002,53,39433.241249999992,53,13481.449999999999,53,43410.268999999993,53,40803.619999999995]
[54,3977.0277500000002,54,39433.241249999992,54,13481.449999999999,54,43410.268999999993,54,40803.619999999995]
[55,3977.0277500000002,55,39433.241249999992,55,13481.449999999999,55,43410.268999999993,55,40803.619999999995]
[56,3977.0277500000002,56,39433.241249999992,56,13481.449999999999,56,43410.268999999993,56,40803.619999999995]
[57,3977.0277500000002,57,39433.241249999992,57,13481.449999999999,57,43410.268999999993,57,40803.619999999995]
[58,3977.0277500000002,58,39433.241249999992,58,13481.449999999999,58,43410.268999999993,58,40803.619999999995]
[59,3977.0277500000002,59,39433.241249999992,59,13481.449999999999,59,43410.268999999993,59,40803.619999999995]
[60,3977.0277500000002,60,39433.241249999992,60,13481.449999999999,60,43410.268999999993,60,40803.619999999995]
[61,3977.0277500000002,61,39433.241249999992,61,13481.449999999999,61,43410.268999999993,61,40803.619999999995]
[62,3977.0277500000002,62,39433.241249999992,62,13481.449999999999,62,43410.268999999993,62,40803.619999999995]
[63,3977.0277500000002,63,39433.241249999992,63,13481.449999999999,63,43410.268999999993,63,40803.619999999995]
[64,3977.0277500000002,64,39433.241249999992,64,13481.449999999999,64,43410.268999999993,64,40803.619999999995]
[65,3977.0277500000002,65,39433.241249999992,65,13481.449999999999,65,43410.268999999993,65,40803.619999999995]
[66,3977.0277500000002,66,39433.241249999992,66,13481.449999999999,66,43410.268999999993,66,40803.619999999995]
[67,3977.0277500000002,67,39433.241249999992,67,13481.449999999999,67,43410.268999999993,67,40803.619999999995]
[68,3977.0277500000002,68,39433.241249999992,68,13481.449999999999,68,43410.268999999993,68,40803.619999999995]
[69,3977.0277500000002,69,39433.241249999992,69,13481.449999999999,69,43410.268999999993,69,40803.619999999995]
[70,3977.0277500000002,70,39433.241249999992,70,13481.449999999999,70,43410.268999999993,70,40803.619999999995]
[71,3977.0277500000002,71,39433.241249999992,71,13481.449999999999,71,43410.268999999993,71,40803.619999999995]
[72,3977.0277500000002,72,39433.241249999992,72,13481.449999999999,72,43410.268999999993,72,40803.619999999995]
[73,3977.0277500000002,73,39433.241249999992,73,13481.449999999999,73,43410.268999999993,73,40803.619999999995]
[74,3977.0277500000002,74,39433.241249999992,74,13481.449999999999,74,43410.268999999993,74,40803.619999999995]
[75,3977.0277500000002,75,39433.241249999992,75,13481.449999999999,75,43410.268999999993,75,40803.619999999995]
[76,3977.0277500000002,76,39433.241249999992,76,13481.449999999999,76,43410.268999999993,76,40803.619999999995]
[77,3977.0277500000002,77,39433.241249999992,77,13481.449999999999,77,43410.268999999993,77,40803.619999999995]
[78,3977.0277500000002,78,39433.241249999992,78,13481.449999999999,78,43410.268999999993,78,40803.619999999995]
[79,3977.0277500000002,79,39433.241249999992,79,13481.449999999999,79,43410.268999999993,79,40803.619999999995]
[80,3977.0277500000002,80,39433.241249999992,80,13481.449999999999,80,43410.268999999993,80,40803.619999999995]
[81,3977.0277500000002,81,39433.241249999992,81,13481.449999999999,81,43410.268999999993,81,40803.619999999995]
[82,3977.0277500000002,82,39433.241249999992,82,13481.449999999999,82,43410.268999999993,82,40803.619999999995]
[83,3977.0277500000002,83,39433.241249999992,83,13481.449999999999,83,43410.268999999993,83,40803.619999999995]
[84,3977.0277500000002,84,39433.241249999992,84,13481.449999999999,84,43410.268999999993,84,40803.619999999995]
[85,3977.0277500000002,85,39433.241249999992,85,13481.449999999999,85,43410.268999999993,85,40803.619999999995]
[86,3977.0277500000002,86,39433.241249999992,86,13481.449999999999,86,43410.268999999993,86,40803.619999999995]
[87,3977.0277500000002,87,39433.241249999992,87,13481.449999999999,87,43410.268999999993,87,40803.619999999995]
[88,3977.0277500000002,88,39433.241249999992,88,13481.449999999999,88,43410.268999999993,88,40803.619999999995]
[89,3977.0277500000002,89,39433.241249999992,89,13481.449999999999,89,43410.268999999993,89,40803.619999999995]
[90,3977.0277500000002,90,39433.241249999992,90,13481.449999999999,90,43410.268999999993,90,40803.619999999995]
[91,3977.0277500000002,91,39433.241249999992,91,13481.449999999999,91,43410.268999999993,91,40803.619999999995]
[92,3977.0277500000002,92,39433.241249999992,92,13481.449999999999,92,43410.268999999993,92,40803.619999999995]
[93,3977.0277500000002,93,39433.241249999992,93,13481.449999999999,93,43410.268999999993,93,40803.619999999995]
[94,3977.0277500000002,94,39433.241249999992,94,13481.449999999999,94,43410.268999999993,94,40803.619999999995]
[95,3977.0277500000002,95,39433.241249999992,95,13481.449999999999,95,43410.268999999993,95,40803.619999999995]
[96,3977.0277500000002,96,39433.241249999992,96,13481.449999999999,96,43410.268999999993,96,40803.619999999995]
[97,3977.0277500000002,97,39433.241249999992,97,13481.449999999999,97,43410.268999999993,97,40803.619999999995]
[98,3977.0277500000002,98,39433.241249999992,98,13481.449999999999,98,43410.268999999993,98,40803.619999999995]
[99,3977.0277500000002,99,39433.241249999992,99,13481.449999999999,99,43410.268999999993,99,40803.619999999995]
[100,3977.0277500000002,100,39433.241249999992,100,13481.449999999999,100,43410.268999999993,100,40803.619999999995]
[101,3977.0277500000002,101,39433.241249999992,101,13481.449999999999,101,43410.268999999993,101,40803.619999999995]
[102,3977.0277500000002,102,39433.241249999992,102,13481.449999999999,102,43410.268999999993,102,40803.619999999995]
[103,3977.0277500000002,103,39433.241249999992,103,13481.449999999999,103,43410.268999999993,103,40803.619999999995]
[104,3977.0277500000002,104,39433.241249999992,104,13481.449999999999,104,43410.268999999993,104,40803.619999999995]
[105,3977.0277500000002,105,39433.241249999992,105,13481.449999999999,105,43410.268999999993,105,40803.619999999995]
[106,3977.0277500000002,106,39433.241249999992,106,13481.449999999999,106,43410.268999999993,106,40803.619999999995]
[107,3977.0277500000002,107,39433.241249999992,107,13481.449999999999,107,43410.268999999993,107,40803.619999999995]
[108,3977.0277500000002,108,39433.241249999992,108,13481.449999999999,108,43410.268999999993,108,40803.619999999995]
[109,3977.0277500000002,109,39433.241249999992,109,13481.449999999999,109,43410.268999999993,109,40803.619999999995]
[110,3977.0277500000002,110,39433.241249999992,110,13481.449999999999,110,43410.268999999993,110,40803.619999999995]
[111,3977.0277500000002,111,39433.241249999992,111,13481.449999999999,111,43410.268999999993,111,40803.619999999995]
[112,3977.0277500000002,112,39433.241249999992,112,13481.449999999999,112,43410.268999999993,112,40803.619999999995]
[113,3977.0277500000002,113,39433.241249999992,113,13481.449999999999,113,43410.268999999993,113,40803.619999999995]
[114,3977.0277500000002,114,39433.241249999992,114,13481.449999999999,114,43410.268999999993,114,40803.619999999995]
[115,3977.0277500000002,115,39433.241249999992,115,13481.449999999999,115,43410.268999999993,115,40803.619999999995]
[116,3977.0277500000002,116,39433.241249999992,116,13481.449999999999,116,43410.268999999993,116,40803.619999999995]
[117,3977.0277500000002,117,39433.241249999992,117,13481.449999999999,117,43410.268999999993,117,40803.619999999995]
[118,3977.0277500000002,118,39433.241249999992,118,13481.449999999999,118,43410.268999999993,118,40803.619999999995]
[119,3977.0277500000002,119,39433.241249999992,119,13481.449999999999,119,43410.268999999993,119,40803.619999999995]
[120,3977.0277500000002,120,39433.241249999992,120,13481.449999999999,120,43410.268999999993,120,40803.619999999995]
[121,3977.0277500000002,121,39433.241249999992,121,13481.449999999999,121,43410.268999999993,121,40803.619999999995]
[122,3977.0277500000002,122,39433.241249999992,122,13481.449999999999,122,43410.268999999993,122,40803.619999999995]
[123,3977.0277500000002,123,39433.241249999992,123,13481.449999999999,123,43410.268999999993,123,40803.619999999995]
[124,3977.0277500000002,124,39433.241249999992,124,13481.449999999999,124,43410.268999999993,124,40803.619999999995]
[125,3977.0277500000002,125,39433.241249999992,125,13481.449999999999,125,43410.268999999993,125,40803.619999999995]
[126,3977.0277500000002,126,39433.241249999992,126,13481.449999999999,126,43410.268999999993,126,40803.619999999995]
[127,3977.0277500000002,127,39433.241249999992,127,13481.449999999999,127,43410.268999999993,127,40803.619999999995]
[128,3977.0277500000002,128,39433.241249999992,128,13481.449999999999,128,43410.268999999993,128,40803.619999999995]
[129,3977.0277500000002,129,39433.241249999992,129,13481.449999999999,129,43410.268999999993,129,40803.619999999995]
[130,3977.0277500000002,130,39433.241249999992,130,13481.449999999999,130,43410.268999999993,130,40803.619999999995]
[131,3977.0277500000002,131,39433.241249999992,131,13481.449999999999,131,43410.268999999993,131,40803.619999999995]
[132,3977.0277500000002,132,39433.241249999992,132,13481.449999999999,132,43410.268999999993,132,40803.619999999995]
[133,3977.0277500000002,133,39433.241249999992,133,13481.449999999999,133,43410.268999999993,133,40803.619999999995]
[134,3977.0277500000002,134,39433.241249999992,134,13481.449999999999,134,43410.268999999993,134,40803.619999999995]
[135,3977.0277500000002,135,39433.241249999992,135,13481.449999999999,135,43410.268999999993,135,40803.619999999995]
[136,3977.0277500000002,136,39433.241249999992,136,13481.449999999999,136,43410.268999999993,136,40803.619999999995]
[137,3977.0277500000002,137,39433.241249999992,137,13481.449999999999,137,43410.268999999993,137,40803.619999999995]
[138,3977.0277500000002,138,39433.241249999992,138,13481.449999999999,138,43410.268999999993,138,40803.619999999995]
[139,3977.0277500000002,139,39433.241249999992,139,13481.449999999999,139,43410.268999999993,139,40803.619999999995]
[140,3977.0277500000002,140,39433.241249999992,140,13481.449999999999,140,43410.268999999993,140,40803.619999999995]
[141,3977.0277500000002,141,39433.241249999992,141,13481.449999999999,141,43410.268999999993,141,40803.619999999995]
[142,3977.0277500000002,142,39433.241249999992,142,13481.449999999999,142,43410.268999999993,142,40803.619999999995]
[143,3977.0277500000002,143,39433.241249999992,143,13481.449999999999,143,43410.268999999993,143,40803.619999999995]
[144,3977.0277500000002,144,39433.241249999992,144,13481.449999999999,144,43410.268999999993,144,40803.619999999995]
[145,3977.0277500000002,145,39433.241249999992,145,13481.449999999999,145,43410.268999999993,145,40803.619999999995]
[146,3977.0277500000002,146,39433.241249999992,146,13481.449999999999,146,43410.268999999993,146,40803.619999999995]
[147,3977.0277500000002,147,39433.241249999992,147,13481.449999999999,147,43410.268999999993,147,40803.619999999995]
[148,3977.0277500000002,148,39433.241249999992,148,13481.449999999999,148,43410.268999999993,148,40803.619999999995]
[149,3977.0277500000002,149,39433.241249999992,149,13481.449999999999,149,43410.268999999993,149,40803.619999999995]
[150,3977.0277500000002,150,39433.241249999992,150,13481.449999999999,150,43410.268999999993,150,40803.619999999995]
[151,3977.0277500000002,151,39433.241249999992,151,13481.449999999999,151,43410.268999999993,151,40803.619999999995]
[152,3977.0277500000002,152,39433.241249999992,152,13481.449999999999,152,43410.268999999993,152,40803.619999999995]
[153,3977.0277500000002,153,39433.241249999992,153,13481.449999999999,153,43410.268999999993,153,40803.619999999995]
[154,3977.0277500000002,154,39433.241249999992,154,13481.449999999999,154,43410.268999999993,154,40803.619999999995]
[155,3977.0277500000002,155,39433.241249999992,155,13481.449999999999,155,43410.268999999993,155,40803.619999999995]
[156,3977.0277500000002,156,39433.241249999992,156,13481.449999999999,156,43410.268999999993,156,40803.619999999995]
[157,3977.0277500000002,157,39433.241249999992,157,13481.449999999999,157,43410.268999999993,157,40803.619999999995]
[158,3977.0277500000002,158,39433.241249999992,158,13481.449999999999,158,43410.268999999993,158,40803.619999999995]
[159,3977.0277500000002,159,39433.241249999992,159,13481.449999999999,159,43410.268999999993,159,40803.619999999995]
[160,3977.0277500000002,160,39433.241249999992,160,13481.449999999999,160,43410.268999999993,160,40803.619999999995]
[161,3977.0277500000002,161,39433.241249999992,161,13481.449999999999,161,43410.268999999993,161,40803.619999999995]
[162,3977.0277500000002,162,39433.241249999992,162,13481.449999999999,162,43410.268999999993,162,40803.619999999995]
[163,3977.0277500000002,163,39433.241249999992,163,13481.449999999999,163,43410.268999999993,163,40803.619999999995]
[164,3977.0277500000002,164,39433.241249999992,164,13481.449999999999,164,43410.268999999993,164,40803.619999999995]
[165,3977.0277500000002,165,39433.241249999992,165,13481.449999999999,165,43410.268999999993,165,40803.619999999995]
[166,3977.0277500000002,166,39433.241249999992,166,13481.449999999999,166,43410.268999999993,166,40803.619999999995]
[167,3977.0277500000002,167,39433.241249999992,167,13481.449999999999,167,43410.268999999993,167,40803.619999999995]
[168,3977.0277500000002,168,39433.241249999992,168,13481.449999999999,168,43410.268999999993,168,40803.619999999995]
[169,3977.0277500000002,169,39433.241249999992,169,13481.449999999999,169,43410.268999999993,169,40803.619999999995]
[170,3977.0277500000002,170,39433.241249999992,170,13481.449999999999,170,43410.268999999993,170,40803.619999999995]
[171,3977.0277500000002,171,39433.241249999992,171,13481.449999999999,171,43410.268999999993,171,40803.619999999995]
[172,3977.0277500000002,172,39433.241249999992,172,13481.449999999999,172,43410.268999999993,172,40803.619999999995]
[173,3977.0277500000002,173,39433.241249999992,173,13481.449999999999,173,43410.268999999993,173,40803.619999999995]
[174,3977.0277500000002,174,39433.241249999992,174,13481.449999999999,174,43410.268999999993,174,40803.619999999995]
[175,3977.0277500000002,175,39433.241249999992,175,13481.449999999999,175,43410.268999999993,175,40803.619999999995]
[176,3977.0277500000002,176,39433.241249999992,176,13481.449999999999,176,43410.268999999993,176,40803.619999999995]
[177,3977.0277500000002,177,39433.241249999992,177,13481.449999999999,177,43410.268999999993,177,40803.619999999995]
[178,3977.0277500000002,178,39433.241249999992,178,13481.449999999999,178,43410.268999999993,178,40803.619999999995]
[179,3977.0277500000002,179,39433.241249999992,179,13481.449999999999,179,43410.268999999993,179,40803.619999999995]
[180,3977.0277500000002,180,39433.241249999992,180,13481.449999999999,180,43410.268999999993,180,40803.619999999995]
[181,3977.0277500000002,181,39433.241249999992,181,13481.449999999999,181,43410.268999999993,181,40803.619999999995]
[182,3977.0277500000002,182,39433.241249999992,182,13481.449999999999,182,43410.268999999993,182,40803.619999999995]
[183,3977.0277500000002,183,39433.241249999992,183,13481.449999999999,183,43410.268999999993,183,40803.619999999995]
[184,3977.0277500000002,184,39433.241249999992,184,13481.449999999999,184,43410.268999999993,184,40803.619999999995]
[185,3977.0277500000002,185,39433.241249999992,185,13481.449999999999,185,43410.268999999993,185,40803.619999999995]
[186,3977.0277500000002,186,39433.241249999992,186,13481.449999999999,186,43410.268999999993,186,40803.619999999995]
[187,3977.0277500000002,187,39433.241249999992,187,13481.449999999999,187,43410.268999999993,187,40803.619999999995]
[188,3977.0277500000002,188,39433.241249999992,188,13481.449999999999,188,43410.268999999993,188,40803.619999999995]
[189,3977.0277500000002,189,39433.241249999992,189,13481.449999999999,189,43410.268999999993,189,40803.619999999995]
[190,3977.0277500000002,190,39433.241249999992,190,13481.449999999999,190,43410.268999999993,190,40803.619999999995]
[191,3977.0277500000002,191,39433.241249999992,191,13481.449999999999,191,43410.268999999993,191,40803.619999999995]
[192,3977.0277500000002,192,39433.241249999992,192,13481.449999999999,192,43410.268999999993,192,40803.619999999995]
[193,3977.0277500000002,193,39433.241249999992,193,13481.449999999999,193,43410.268999999993,193,40803.619999999995]
[194,3977.0277500000002,194,39433.241249999992,194,13481.449999999999,194,43410.268999999993,194,40803.619999999995]
[195,3977.0277500000002,195,39433.241249999992,195,13481.449999999999,195,43410.268999999993,195,40803.619999999995]
[196,3977.0277500000002,196,39433.241249999992,196,13481.449999999999,196,43410.268999999993,196,40803.619999999995]
[197,3977.0277500000002,197,39433.241249999992,197,13481.449999999999,197,43410.268999999993,197,40803.619999999995]
[198,3977.0277500000002,198,39433.241249999992,198,13481.449999999999,198,43410.268999999993,198,40803.619999999995]
[199,3977.0277500000002,199,39433.241249999992,199,13481.449999999999,199,43410.268999999993,199,40803.619999999995]
[200,3977.0277500000002,200,39433.241249999992,200,13481.449999999999,200,43410.268999999993,200,40803.619999999995]
[201,3977.0277500000002,201,39433.241249999992,201,13481.449999999999,201,43410.268999999993,201,40803.619999999995]
[202,3977.0277500000002,202,39433.241249999992,202,13481.449999999999,202,43410.268999999993,202,40803.619999999995]
[203,3977.0277500000002,203,39433.241249999992,203,13481.449999999999,203,43410.268999999993,203,40803.619999999995]
[204,3977.0277500000002,204,39433.241249999992,204,13481.449999999999,204,43410.268999999993,204,40803.619999999995]
[205,3977.0277500000002,205,39433.241249999992,205,13481.449999999999,205,43410.268999999993,205,40803.619999999995]
[206,3977.0277500000002,206,39433.241249999992,206,13481.449999999999,206,43410.268999999993,206,40803.619999999995]
[207,3977.0277500000002,207,39433.241249999992,207,13481.449999999999,207,43410.268999999993,207,40803.619999999995]
[208,3977.0277500000002,208,39433.241249999992,208,13481.449999999999,208,43410.268999999993,208,40803.619999999995]
[209,3977.0277500000002,209,39433.241249999992,209,13481.449999999999,209,43410.268999999993,209,40803.619999999995]
[210,3977.0277500000002,210,39433.241249999992,210,13481.449999999999,210,43410.268999999993,210,40803.619999999995]
[211,3977.0277500000002,211,39433.241249999992,211,13481.449999999999,211,43410.268999999993,211,40803.619999999995]
[212,3977.0277500000002,212,39433.241249999992,212,13481.449999999999,212,43410.268999999993,212,40803.619999999995]
[213,3977.0277500000002,213,39433.241249999992,213,13481.449999999999,213,43410.268999999993,213,40803.619999999995]
[214,3977.0277500000002,214,39433.241249999992,214,13481.449999999999,214,43410.268999999993,214,40803.619999999995]
[215,3977.0277500000002,215,39433.241249999992,215,13481.449999999999,215,43410.268999999993,215,40803.619999999995]
[216,3977.0277500000002,216,39433.241249999992,216,13481.449999999999,216,43410.268999999993,216,40803.619999999995]
[217,3977.0277500000002,217,39433.241249999992,217,13481.449999999999,217,43410.268999999993,217,40803.619999999995]
[218,3977.0277500000002,218,39433.241249999992,218,13481.449999999999,218,43410.268999999993,218,40803.619999999995]
[219,3977.0277500000002,219,39433.241249999992,219,13481.449999999999,219,43410.268999999993,219,40803.619999999995]
[220,3977.0277500000002,220,39433.241249999992,220,13481.449999999999,220,43410.268999999993,220,40803.619999999995]
[221,3977.0277500000002,221,39433.241249999992,221,13481.449999999999,221,43410.268999999993,221,40803.619999999995]
[222,3977.0277500000002,222,39433.241249999992,222,13481.449999999999,222,43410.268999999993,222,40803.619999999995]
[223,3977.0277500000002,223,39433.241249999992,223,13481.449999999999,223,43410.268999999993,223,40803.619999999995]
[224,3977.0277500000002,224,39433.241249999992,224,13481.449999999999,224,43410.268999999993,224,40803.619999999995]
[225,3977.0277500000002,225,39433.241249999992,225,13481.449999999999,225,43410.268999999993,225,40803.619999999995]
[226,3977.0277500000002,226,39433.241249999992,226,13481.449999999999,226,43410.268999999993,226,40803.619999999995]
[227,3977.0277500000002,227,39433.241249999992,227,13481.449999999999,227,43410.268999999993,227,40803.619999999995]
[228,3977.0277500000002,228,39433.241249999992,228,13481.449999999999,228,43410.268999999993,228,40803.619999999995]
[229,3977.0277500000002,229,39433.241249999992,229,13481.449999999999,229,43410.268999999993,229,40803.619999999995]
[230,3977.0277500000002,230,39433.241249999992,230,13481.449999999999,230,43410.268999999993,230,40803.619999999995]
[231,3977.0277500000002,231,39433.241249999992,231,13481.449999999999,231,43410.268999999993,231,40803.619999999995]
[232,3977.0277500000002,232,39433.241249999992,232,13481.449999999999,232,43410.268999999993,232,40803.619999999995]
[233,3977.0277500000002,233,39433.241249999992,233,13481.449999999999,233,43410.268999999993,233,40803.619999999995]
[234,3977.0277500000002,234,39433.241249999992,234,13481.449999999999,234,43410.268999999993,234,40803.619999999995]
[235,3977.0277500000002,235,39433.241249999992,235,13481.449999999999,235,43410.268999999993,235,40803.619999999995]
[236,3977.0277500000002,236,39433.241249999992,236,13481.449999999999,236,43410.268999999993,236,40803.619999999995]
[237,3977.0277500000002,237,39433.241249999992,237,13481.449999999999,237,43410.268999999993,237,40803.619999999995]
[238,3977.0277500000002,238,39433.241249999992,238,13481.449999999999,238,43410.268999999993,238,40803.619999999995]
[239,3977.0277500000002,239,39433.241249999992,239,13481.449999999999,239,43410.268999999993,239,40803.619999999995]
[240,3977.0277500000002,240,39433.241249999992,240,13481.449999999999,240,43410.268999999993,240,40803.619999999995]
[241,3977.0277500000002,241,39433.241249999992,241,13481.449999999999,241,43410.268999999993,241,40803.619999999995]
[242,3977.0277500000002,242,39433.241249999992,242,13481.449999999999,242,43410.268999999993,242,40803.619999999995]
[243,3977.0277500000002,243,39433.241249999992,243,13481.449999999999,243,43410.268999999993,243,40803.619999999995]
[244,3977.0277500000002,244,39433.241249999992,244,13481.449999999999,244,43410.268999999993,244,40803.619999999995]
[245,3977.0277500000002,245,39433.241249999992,245,13481.449999999999,245,43410.268999999993,245,40803.619999999995]
[246,3977.0277500000002,246,39433.241249999992,246,13481.449999999999,246,43410.268999999993,246,40803.619999999995]
[247,3977.0277500000002,247,39433.241249999992,247,13481.449999999999,247,43410.268999999993,247,40803.619999999995]
[248,3977.0277500000002,248,39433.241249999992,248,13481.449999999999,248,43410.268999999993,248,40803.619999999995]
[249,3977.0277500000002,249,39433.241249999992,249,13481.449999999999,249,43410.268999999993,249,40803.619999999995]
[250,3977.0277500000002,250,39433.241249999992,250,13481.449999999999,250,43410.268999999993,250,40803.619999999995]
[251,3977.0277500000002,251,39433.241249999992,251,13481.449999999999,251,43410.268999999993,251,40803.619999999995]
[252,3977.0277500000002,252,39433.241249999992,252,13481.449999999999,252,43410.268999999993,252,40803.619999999995]
[253,3977.0277500000002,253,39433.241249999992,253,13481.449999999999,253,43410.268999999993,253,40803.619999999995]
[254,3977.0277500000002,254,39433.241249999992,254,13481.449999999999,254,43410.268999999993,254,40803.619999999995]
[255,3977.0277500000002,255,39433.241249999992,255,13481.449999999999,255,43410.268999999993,255,40803.619999999995]
[256,3977.0277500000002,256,39433.241249999992,256,13481.449999999999,256,43410.268999999993,256,40803.619999999995]
[257,3977.0277500000002,257,39433.241249999992,257,13481.449999999999,257,43410.268999999993,257,40803.619999999995]
[258,3977.0277500000002,258,39433.241249999992,258,13481.449999999999,258,43410.268999999993,258,40803.619999999995]
[259,3977.0277500000002,259,39433.241249999992,259,13481.449999999999,259,43410.268999999993,259,40803.619999999995]
[260,3977.0277500000002,260,39433.241249999992,260,13481.449999999999,260,43410.268999999993,260,40803.619999999995]
[261,3977.0277500000002,261,39433.241249999992,261,13481.449999999999,261,43410.268999999993,261,40803.619999999995]
[262,3977.0277500000002,262,39433.241249999992,262,13481.449999999999,262,43410.268999999993,262,40803.619999999995]
[263,3977.0277500000002,263,39433.241249999992,263,13481.449999999999,263,43410.268999999993,263,40803.619999999995]
[264,3977.0277500000002,264,39433.241249999992,264,13481.449999999999,264,43410.268999999993,264,40803.619999999995]
[265,3977.0277500000002,265,39433.241249999992,265,13481.449999999999,265,43410.268999999993,265,40803.619999999995]
[266,3977.0277500000002,266,39433.241249999992,266,13481.449999999999,266,43410.268999999993,266,40803.619999999995]
[267,3977.0277500000002,267,39433.241249999992,267,13481.449999999999,267,43410.268999999993,267,40803.619999999995]
[268,3977.0277500000002,268,39433.241249999992,268,13481.449999999999,268,43410.268999999993,268,40803.619999999995]
[269,3977.0277500000002,269,39433.241249999992,269,13481.449999999999,269,43410.268999999993,269,40803.619999999995]
[270,3977.0277500000002,270,39433.241249999992,270,13481.449999999999,270,43410.268999999993,270,40803.619999999995]
[271,3977.0277500000002,271,39433.241249999992,271,13481.449999999999,271,43410.268999999993,271,40803.619999999995]
[272,3977.0277500000002,272,39433.241249999992,272,13481.449999999999,272,43410.268999999993,272,40803.619999999995]
[273,3977.0277500000002,273,39433.241249999992,273,13481.449999999999,273,43410.268999999993,273,40803.619999999995]
[274,3977.0277500000002,274,39433.241249999992,274,13481.449999999999,274,43410.268999999993,274,40803.619999999995]
[275,3977.0277500000002,275,39433.241249999992,275,13481.449999999999,275,43410.268999999993,275,40803.619999999995]
[276,3977.0277500000002,276,39433.241249999992,276,13481.449999999999,276,43410.268999999993,276,40803.619999999995]
[277,3977.0277500000002,277,39433.241249999992,277,13481.449999999999,277,43410.268999999993,277,40803.619999999995]
[278,3977.0277500000002,278,39433.241249999992,278,13481.449999999999,278,43410.268999999993,278,40803.619999999995]
[279,3977.0277500000002,279,39433.241249999992,279,13481.449999999999,279,43410.268999999993,279,40803.619999999995]
[280,3977.0277500000002,280,39433.241249999992,280,13481.449999999999,280,43410.268999999993,280,40803.619999999995]
[281,3977.0277500000002,281,39433.241249999992,281,13481.449999999999,281,43410.268999999993,281,40803.619999999995]
[282,3977.0277500000002,282,39433.241249999992,282,13481.449999999999,282,43410.268999999993,282,40803.619999999995]
[283,3977.0277500000002,283,39433.241249999992,283,13481.449999999999,283,43410.268999999993,283,40803.619999999995]
[284,3977.0277500000002,284,39433.241249999992,284,13481.449999999999,284,43410.268999999993,284,40803.619999999995]
[285,3977.0277500000002,285,39433.241249999992,285,13481.449999999999,285,43410.268999999993,285,40803.619999999995]
[286,3977.0277500000002,286,39433.241249999992,286,13481.449999999999,286,43410.268999999993,286,40803.619999999995]
[287,3977.0277500000002,287,39433.241249999992,287,13481.449999999999,287,43410.268999999993,287,40803.619999999995]
[288,3977.0277500000002,288,39433.241249999992,288,13481.449999999999,288,43410.268999999993,288,40803.619999999995]
[289,3977.0277500000002,289,39433.241249999992,289,13481.449999999999,289,43410.268999999993,289,40803.619999999995]
[290,3977.0277500000002,290,39433.241249999992,290,13481.449999999999,290,43410.268999999993,290,40803.619999999995]
[291,3977.0277500000002,291,39433.241249999992,291,13481.449999999999,291,43410.268999999993,291,40803.619999999995]
[292,3977.0277500000002,292,39433.241249999992,292,13481.449999999999,292,43410.268999999993,292,40803.619999999995]
[293,3977.0277500000002,293,39433.241249999992,293,13481.449999999999,293,43410.268999999993,293,40803.619999999995]
[294,3977.0277500000002,294,39433.241249999992,294,13481.449999999999,294,43410.268999999993,294,40803.619999999995]
[295,3977.0277500000002,295,39433.241249999992,295,13481.449999999999,295,43410.268999999993,295,40803.619999999995]
[296,3977.0277500000002,296,39433.241249999992,296,13481.449999999999,296,43410.268999999993,296,40803.619999999995]
[297,3977.0277500000002,297,39433.241249999992,297,13481.449999999999,297,43410.268999999993,297,40803.619999999995]
[298,3977.0277500000002,298,39433.241249999992,298,13481.449999999999,298,43410.268999999993,298,40803.619999999995]
[299,3977.0277500000002,299,39433.241249999992,299,13481.449999999999,299,43410.268999999993,299,40803.619999999995]
[300,3977.0277500000002,300,39433.241249999992,300,13481.449999999999,300,43410.268999999993,300,40803.619999999995]
[301,3977.0277500000002,301,39433.241249999992,301,13481.449999999999,301,43410.268999999993,301,40803.619999999995]
[302,3977.0277500000002,302,39433.241249999992,302,13481.449999999999,302,43410.268999999993,302,40803.619999999995]
[303,3977.0277500000002,303,39433.241249999992,303,13481.449999999999,303,43410.268999999993,303,40803.619999999995]
[304,3977.0277500000002,304,39433.241249999992,304,13481.449999999999,304,43410.268999999993,304,40803.619999999995]
[305,3977.0277500000002,305,39433.241249999992,305,13481.449999999999,305,43410.268999999993,305,40803.619999999995]
[306,3977.0277500000002,306,39433.241249999992,306,13481.449999999999,306,43410.268999999993,306,40803.619999999995]
[307,3977.0277500000002,307,39433.241249999992,307,13481.449999999999,307,43410.268999999993,307,40803.619999999995]
[308,3977.0277500000002,308,39433.241249999992,308,13481.449999999999,308,43410.268999999993,308,40803.619999999995]
[309,3977.0277500000002,309,39433.241249999992,309,13481.449999999999,309,43410.268999999993,309,40803.619999999995]
[310,3977.0277500000002,310,39433.241249999992,310,13481.449999999999,310,43410.268999999993,310,40803.619999999995]
[311,3977.0277500000002,311,39433.241249999992,311,13481.449999999999,311,43410.268999999993,311,40803.619999999995]
[312,3977.0277500000002,312,39433.241249999992,312,13481.449999999999,312,43410.268999999993,312,40803.619999999995]
[313,3977.0277500000002,313,39433.241249999992,313,13481.449999999999,313,43410.268999999993,313,40803.619999999995]
[314,3977.0277500000002,314,39433.241249999992,314,13481.449999999999,314,43410.268999999993,314,40803.619999999995]
[315,3977.0277500000002,315,39433.241249999992,315,13481.449999999999,315,43410.268999999993,315,40803.619999999995]
[316,3977.0277500000002,316,39433.241249999992,316,13481.449999999999,316,43410.268999999993,316,40803.619999999995]
[317,3977.0277500000002,317,39433.241249999992,317,13481.449999999999,317,43410.268999999993,317,40803.619999999995]
[318,3977.0277500000002,318,39433.241249999992,318,13481.449999999999,318,43410.268999999993,318,40803.619999999995]
[319,3977.0277500000002,319,39433.241249999992,319,13481.449999999999,319,43410.268999999993,319,40803.619999999995]
[320,3977.0277500000002,320,39433.241249999992,320,13481.449999999999,320,43410.268999999993,320,40803.619999999995]
[321,3977.0277500000002,321,39433.241249999992,321,13481.449999999999,321,43410.268999999993,321,40803.619999999995]
[322,3977.0277500000002,322,39433.241249999992,322,13481.449999999999,322,43410.268999999993,322,40803.619999999995]
[323,3977.0277500000002,323,39433.241249999992,323,13481.449999999999,323,43410.268999999993,323,40803.619999999995]
[324,3977.0277500000002,324,39433.241249999992,324,13481.449999999999,324,43410.268999999993,324,40803.619999999995]
[325,3977.0277500000002,325,39433.241249999992,325,13481.449999999999,325,43410.268999999993,325,40803.619999999995]
[326,3977.0277500000002,326,39433.241249999992,326,13481.449999999999,326,43410.268999999993,326,40803.619999999995]
[327,3977.0277500000002,327,39433.241249999992,327,13481.449999999999,327,43410.268999999993,327,40803.619999999995]
[328,3977.0277500000002,328,39433.241249999992,328,13481.449999999999,328,43410.268999999993,328,40803.619999999995]
[329,3977.0277500000002,329,39433.241249999992,329,13481.449999999999,329,43410.268999999993,329,40803.619999999995]
[330,3977.0277500000002,330,39433.241249999992,330,13481.449999999999,330,43410.268999999993,330,40803.619999999995]
[331,3977.0277500000002,331,39433.241249999992,331,13481.449999999999,331,43410.268999999993,331,40803.619999999995]
[332,3977.0277500000002,332,39433.241249999992,332,13481.449999999999,332,43410.268999999993,332,40803.619999999995]
[333,3977.0277500000002,333,39433.241249999992,333,13481.449999999999,333,43410.268999999993,333,40803.619999999995]
[334,3977.0277500000002,334,39433.241249999992,334,13481.449999999999,334,43410.268999999993,334,40803.619999999995]
[335,3977.0277500000002,335,39433.241249999992,335,13481.449999999999,335,43410.268999999993,335,40803.619999999995]
[336,3977.0277500000002,336,39433.241249999992,336,13481.449999999999,336,43410.268999999993,336,40803.619999999995]
[337,3977.0277500000002,337,39433.241249999992,337,13481.449999999999,337,43410.268999999993,337,40803.619999999995]
[338,3977.0277500000002,338,39433.241249999992,338,13481.449999999999,338,43410.268999999993,338,40803.619999999995]
[339,3977.0277500000002,339,39433.241249999992,339,13481.449999999999,339,43410.268999999993,339,40803.619999999995]
[340,3977.0277500000002,340,39433.241249999992,340,13481.449999999999,340,43410.268999999993,340,40803.619999999995]
[341,3977.0277500000002,341,39433.241249999992,341,13481.449999999999,341,43410.268999999993,341,40803.619999999995]
[342,3977.0277500000002,342,39433.241249999992,342,13481.449999999999,342,43410.268999999993,342,40803.619999999995]
[343,3977.0277500000002,343,39433.241249999992,343,13481.449999999999,343,43410.268999999993,343,40803.619999999995]
[344,3977.0277500000002,344,39433.241249999992,344,13481.449999999999,344,43410.268999999993,344,40803.619999999995]
[345,3977.0277500000002,345,39433.241249999992,345,13481.449999999999,345,43410.268999999993,345,40803.619999999995]
[346,3977.0277500000002,346,39433.241249999992,346,13481.449999999999,346,43410.268999999993,346,40803.619999999995]
[347,3977.0277500000002,347,39433.241249999992,347,13481.449999999999,347,43410.268999999993,347,40803.619999999995]
[348,3977.0277500000002,348,39433.241249999992,348,13481.449999999999,348,43410.268999999993,348,40803.619999999995]
[349,3977.0277500000002,349,39433.241249999992,349,13481.449999999999,349,43410.268999999993,349,40803.619999999995]
[350,3977.0277500000002,350,39433.241249999992,350,13481.449999999999,350,43410.268999999993,350,40803.619999999995]
[351,3977.0277500000002,351,39433.241249999992,351,13481.449999999999,351,43410.268999999993,351,40803.619999999995]
[352,3977.0277500000002,352,39433.241249999992,352,13481.449999999999,352,43410.268999999993,352,40803.619999999995]
[353,3977.0277500000002,353,39433.241249999992,353,13481.449999999999,353,43410.268999999993,353,40803.619999999995]
[354,3977.0277500000002,354,39433.241249999992,354,13481.449999999999,354,43410.268999999993,354,40803.619999999995]
[355,3977.0277500000002,355,39433.241249999992,355,13481.449999999999,355,43410.268999999993,355,40803.619999999995]
[356,3977.0277500000002,356,39433.241249999992,356,13481.449999999999,356,43410.268999999993,356,40803.619999999995]
[357,3977.0277500000002,357,39433.241249999992,357,13481.449999999999,357,43410.268999999993,357,40803.619999999995]
[358,3977.0277500000002,358,39433.241249999992,358,13481.449999999999,358,43410.268999999993,358,40803.619999999995]
[359,3977.0277500000002,359,39433.241249999992,359,13481.449999999999,359,43410.268999999993,359,40803.619999999995]
[360,3977.0277500000002,360,39433.241249999992,360,13481.449999999999,360,43410.268999999993,360,40803.619999999995]
[361,3977.0277500000002,361,39433.241249999992,361,13481.449999999999,361,43410.268999999993,361,40803.619999999995]
[362,3977.0277500000002,362,39433.241249999992,362,13481.449999999999,362,43410.268999999993,362,40803.619999999995]
[363,3977.0277500000002,363,39433.241249999992,363,13481.449999999999,363,43410.268999999993,363,40803.619999999995]
[364,3977.0277500000002,364,39433.241249999992,364,13481.449999999999,364,43410.268999999993,364,40803.619999999995]
[365,3977.0277500000002,365,39433.241249999992,365,13481.449999999999,365,43410.268999999993,365,40803.619999999995]
[366,3977.0277500000002,366,39433.241249999992,366,13481.449999999999,366,43410.268999999993,366,40803.619999999995]
[367,3977.0277500000002,367,39433.241249999992,367,13481.449999999999,367,43410.268999999993,367,40803.619999999995]
[368,3977.0277500000002,368,39433.241249999992,368,13481.449999999999,368,43410.268999999993,368,40803.619999999995]
[369,3977.0277500000002,369,39433.241249999992,369,13481.449999999999,369,43410.268999999993,369,40803.619999999995]
[370,3977.0277500000002,370,39433.241249999992,370,13481.449999999999,370,43410.268999999993,370,40803.619999999995]
[371,3977.0277500000002,371,39433.241249999992,371,13481.449999999999,371,43410.268999999993,371,40803.619999999995]
[372,3977.0277500000002,372,39433.241249999992,372,13481.449999999999,372,43410.268999999993,372,40803.619999999995]
[373,3977.0277500000002,373,39433.241249999992,373,13481.449999999999,373,43410.268999999993,373,40803.619999999995]
[374,3977.0277500000002,374,39433.241249999992,374,13481.449999999999,374,43410.268999999993,374,40803.619999999995]
[375,3977.0277500000002,375,39433.241249999992,375,13481.449999999999,375,43410.268999999993,375,40803.619999999995]
[376,3977.0277500000002,376,39433.241249999992,376,13481.449999999999,376,43410.268999999993,376,40803.619999999995]
[377,3977.0277500000002,377,39433.241249999992,377,13481.449999999999,377,43410.268999999993,377,40803.619999999995]
[378,3977.0277500000002,378,39433.241249999992,378,13481.449999999999,378,43410.268999999993,378,40803.619999999995]
[379,3977.0277500000002,379,39433.241249999992,379,13481.449999999999,379,43410.268999999993,379,40803.619999999995]
[380,3977.0277500000002,380,39433.241249999992,380,13481.449999999999,380,43410.268999999993,380,40803.619999999995]
[381,3977.0277500000002,381,39433.241249999992,381,13481.449999999999,381,43410.268999999993,381,40803.619999999995]
[382,3977.0277500000002,382,39433.241249999992,382,13481.449999999999,382,43410.268999999993,382,40803.619999999995]
[383,3977.0277500000002,383,39433.241249999992,383,13481.449999999999,383,43410.268999999993,383,40803.619999999995]
[384,3977.0277500000002,384,39433.241249999992,384,13481.449999999999,384,43410.268999999993,384,40803.619999999995]
[385,3977.0277500000002,385,39433.241249999992,385,13481.449999999999,385,43410.268999999993,385,40803.619999999995]
[386,3977.0277500000002,386,39433.241249999992,386,13481.449999999999,386,43410.268999999993,386,40803.619999999995]
[387,3977.0277500000002,387,39433.241249999992,387,13481.449999999999,387,43410.268999999993,387,40803.619999999995]
[388,3977.0277500000002,388,39433.241249999992,388,13481.449999999999,388,43410.268999999993,388,40803.619999999995]
[389,3977.0277500000002,389,39433.241249999992,389,13481.449999999999,389,43410.268999999993,389,40803.619999999995]
[390,3977.0277500000002,390,39433.241249999992,390,13481.449999999999,390,43410.268999999993,390,40803.619999999995]
[391,3977.0277500000002,391,39433.241249999992,391,13481.449999999999,391,43410.268999999993,391,40803.619999999995]
[392,3977.0277500000002,392,39433.241249999992,392,13481.449999999999,392,43410.268999999993,392,40803.619999999995]
[393,3977.0277500000002,393,39433.241249999992,393,13481.449999999999,393,43410.268999999993,393,40803.619999999995]
[394,3977.0277500000002,394,39433.241249999992,394,13481.449999999999,394,43410.268999999993,394,40803.619999999995]
[395,3977.0277500000002,395,39433.241249999992,395,13481.449999999999,395,43410.268999999993,395,40803.619999999995]
[396,3977.0277500000002,396,39433.241249999992,396,13481.449999999999,396,43410.268999999993,396,40803.619999999995]
[397,3977.0277500000002,397,39433.241249999992,397,13481.449999999999,397,43410.268999999993,397,40803.619999999995]
[398,3977.0277500000002,398,39433.241249999992,398,13481.449999999999,398,43410.268999999993,398,40803.619999999995]
[399,3977.0277500000002,399,39433.241249999992,399,13481.449999999999,399,43410.268999999993,399,40803.619999999995]
[400,3977.0277500000002,400,39433.241249999992,400,13481.449999999999,400,43410.268999999993,400,40803.619999999995]
[401,3977.0277500000002,401,39433.241249999992,401,13481.449999999999,401,43410.268999999993,401,40803.619999999995]
[402,3977.0277500000002,402,39433.241249999992,402,13481.449999999999,402,43410.268999999993,402,40803.619999999995]
[403,3977.0277500000002,403,39433.241249999992,403,13481.449999999999,403,43410.268999999993,403,40803.619999999995]
[404,3977.0277500000002,404,39433.241249999992,404,13481.449999999999,404,43410.268999999993,404,40803.619999999995]
[405,3977.0277500000002,405,39433.241249999992,405,13481.449999999999,405,43410.268999999993,405,40803.619999999995]
[406,3977.0277500000002,406,39433.241249999992,406,13481.449999999999,406,43410.268999999993,406,40803.619999999995]
[407,3977.0277500000002,407,39433.241249999992,407,13481.449999999999,407,43410.268999999993,407,40803.619999999995]
[408,3977.0277500000002,408,39433.241249999992,408,13481.449999999999,408,43410.268999999993,408,40803.619999999995]
[409,3977.0277500000002,409,39433.241249999992,409,13481.449999999999,409,43410.268999999993,409,40803.619999999995]
[410,3977.0277500000002,410,39433.241249999992,410,13481.449999999999,410,43410.268999999993,410,40803.619999999995]
[411,3977.0277500000002,411,39433.241249999992,411,13481.449999999999,411,43410.268999999993,411,40803.619999999995]
[412,3977.0277500000002,412,39433.241249999992,412,13481.449999999999,412,43410.268999999993,412,40803.619999999995]
[413,3977.0277500000002,413,39433.241249999992,413,13481.449999999999,413,43410.268999999993,413,40803.619999999995]
[414,3977.0277500000002,414,39433.241249999992,414,13481.449999999999,414,43410.268999999993,414,40803.619999999995]
[415,3977.0277500000002,415,39433.241249999992,415,13481.449999999999,415,43410.268999999993,415,40803.619999999995]
[416,3977.0277500000002,416,39433.241249999992,416,13481.449999999999,416,43410.268999999993,416,40803.619999999995]
[417,3977.0277500000002,417,39433.241249999992,417,13481.449999999999,417,43410.268999999993,417,40803.619999999995]
[418,3977.0277500000002,418,39433.241249999992,418,13481.449999999999,418,43410.268999999993,418,40803.619999999995]
[419,3977.0277500000002,419,39433.241249999992,419,13481.449999999999,419,43410.268999999993,419,40803.619999999995]
[420,3977.0277500000002,420,39433.241249999992,420,13481.449999999999,420,43410.268999999993,420,40803.619999999995]
[421,3977.0277500000002,421,39433.241249999992,421,13481.449999999999,421,43410.268999999993,421,40803.619999999995]
[422,3977.0277500000002,422,39433.241249999992,422,13481.449999999999,422,43410.268999999993,422,40803.619999999995]
[423,3977.0277500000002,423,39433.241249999992,423,13481.449999999999,423,43410.268999999993,423,40803.619999999995]
[424,3977.0277500000002,424,39433.241249999992,424,13481.449999999999,424,43410.268999999993,424,40803.619999999995]
[425,3977.0277500000002,425,39433.241249999992,425,13481.449999999999,425,43410.268999999993,425,40803.619999999995]
[426,3977.0277500000002,426,39433.241249999992,426,13481.449999999999,426,43410.268999999993,426,40803.619999999995]
[427,3977.0277500000002,427,39433.241249999992,427,13481.449999999999,427,43410.268999999993,427,40803.619999999995]
[428,3977.0277500000002,428,39433.241249999992,428,13481.449999999999,428,43410.268999999993,428,40803.619999999995]
[429,3977.0277500000002,429,39433.241249999992,429,13481.449999999999,429,43410.268999999993,429,40803.619999999995]
[430,3977.0277500000002,430,39433.241249999992,430,13481.449999999999,430,43410.268999999993,430,40803.619999999995]
[431,3977.0277500000002,431,39433.241249999992,431,13481.449999999999,431,43410.268999999993,431,40803.619999999995]
[432,3977.0277500000002,432,39433.241249999992,432,13481.449999999999,432,43410.268999999993,432,40803.619999999995]
[433,3977.0277500000002,433,39433.241249999992,433,13481.449999999999,433,43410.268999999993,433,40803.619999999995]
[434,3977.0277500000002,434,39433.241249999992,434,13481.449999999999,434,43410.268999999993,434,40803.619999999995]
[435,3977.0277500000002,435,39433.241249999992,435,13481.449999999999,435,43410.268999999993,435,40803.619999999995]
[436,3977.0277500000002,436,39433.241249999992,436,13481.449999999999,436,43410.268999999993,436,40803.619999999995]
[437,3977.0277500000002,437,39433.241249999992,437,13481.449999999999,437,43410.268999999993,437,40803.619999999995]
[438,3977.0277500000002,438,39433.241249999992,438,13481.449999999999,438,43410.268999999993,438,40803.619999999995]
[439,3977.0277500000002,439,39433.241249999992,439,13481.449999999999,439,43410.268999999993,439,40803.619999999995]
[440,3977.0277500000002,440,39433.241249999992,440,13481.449999999999,440,43410.268999999993,440,40803.619999999995]
[441,3977.0277500000002,441,39433.241249999992,441,13481.449999999999,441,43410.268999999993,441,40803.619999999995]
[442,3977.0277500000002,442,39433.241249999992,442,13481.449999999999,442,43410.268999999993,442,40803.619999999995]
[443,3977.0277500000002,443,39433.241249999992,443,13481.449999999999,443,43410.268999999993,443,40803.619999999995]
[444,3977.0277500000002,444,39433.241249999992,444,13481.449999999999,444,43410.268999999993,444,40803.619999999995]
[445,3977.0277500000002,445,39433.241249999992,445,13481.449999999999,445,43410.268999999993,445,40803.619999999995]
[446,3977.0277500000002,446,39433.241249999992,446,13481.449999999999,446,43410.268999999993,446,40803.619999999995]
[447,3977.0277500000002,447,39433.241249999992,447,13481.449999999999,447,43410.268999999993,447,40803.619999999995]
[448,3977.0277500000002,448,39433.241249999992,448,13481.449999999999,448,43410.268999999993,448,40803.619999999995]
[449,3977.0277500000002,449,39433.241249999992,449,13481.449999999999,449,43410.268999999993,449,40803.619999999995]
[450,3977.0277500000002,450,39433.241249999992,450,13481.449999999999,450,43410.268999999993,450,40803.619999999995]
[451,3977.0277500000002,451,39433.241249999992,451,13481.449999999999,451,43410.268999999993,451,40803.619999999995]
[452,3977.0277500000002,452,39433.241249999992,452,13481.449999999999,452,43410.268999999993,452,40803.619999999995]
[453,3977.0277500000002,453,39433.241249999992,453,13481.449999999999,453,43410.268999999993,453,40803.619999999995]
[454,3977.0277500000002,454,39433.241249999992,454,13481.449999999999,454,43410.268999999993,454,40803.619999999995]
[455,3977.0277500000002,455,39433.241249999992,455,13481.449999999999,455,43410.268999999993,455,40803.619999999995]
[456,3977.0277500000002,456,39433.241249999992,456,13481.449999999999,456,43410.268999999993,456,40803.619999999995]
[457,3977.0277500000002,457,39433.241249999992,457,13481.449999999999,457,43410.268999999993,457,40803.619999999995]
[458,3977.0277500000002,458,39433.241249999992,458,13481.449999999999,458,43410.268999999993,458,40803.619999999995]
[459,3977.0277500000002,459,39433.241249999992,459,13481.449999999999,459,43410.268999999993,459,40803.619999999995]
[460,3977.0277500000002,460,39433.241249999992,460,13481.449999999999,460,43410.268999999993,460,40803.619999999995]
[461,3977.0277500000002,461,39433.241249999992,461,13481.449999999999,461,43410.268999999993,461,40803.619999999995]
[462,3977.0277500000002,462,39433.241249999992,462,13481.449999999999,462,43410.268999999993,462,40803.619999999995]
[463,3977.0277500000002,463,39433.241249999992,463,13481.449999999999,463,43410.268999999993,463,40803.619999999995]
[464,3977.0277500000002,464,39433.241249999992,464,13481.449999999999,464,43410.268999999993,464,40803.619999999995]
[465,3977.0277500000002,465,39433.241249999992,465,13481.449999999999,465,43410.268999999993,465,40803.619999999995]
[466,3977.0277500000002,466,39433.241249999992,466,13481.449999999999,466,43410.268999999993,466,40803.619999999995]
[467,3977.0277500000002,467,39433.241249999992,467,13481.449999999999,467,43410.268999999993,467,40803.619999999995]
[468,3977.0277500000002,468,39433.241249999992,468,13481.449999999999,468,43410.268999999993,468,40803.619999999995]
[469,3977.0277500000002,469,39433.241249999992,469,13481.449999999999,469,43410.268999999993,469,40803.619999999995]
[470,3977.0277500000002,470,39433.241249999992,470,13481.449999999999,470,43410.268999999993,470,40803.619999999995]
[471,3977.0277500000002,471,39433.241249999992,471,13481.449999999999,471,43410.268999999993,471,40803.619999999995]
[472,3977.0277500000002,472,39433.241249999992,472,13481.449999999999,472,43410.268999999993,472,40803.619999999995]
[473,3977.0277500000002,473,39433.241249999992,473,13481.449999999999,473,43410.268999999993,473,40803.619999999995]
[474,3977.0277500000002,474,39433.241249999992,474,13481.449999999999,474,43410.268999999993,474,40803.619999999995]
[475,3977.0277500000002,475,39433.241249999992,475,13481.449999999999,475,43410.268999999993,475,40803.619999999995]
[476,3977.0277500000002,476,39433.241249999992,476,13481.449999999999,476,43410.268999999993,476,40803.619999999995]
[477,3977.0277500000002,477,39433.241249999992,477,13481.449999999999,477,43410.268999999993,477,40803.619999999995]
[478,3977.0277500000002,478,39433.241249999992,478,13481.449999999999,478,43410.268999999993,478,40803.619999999995]
[479,3977.0277500000002,479,39433.241249999992,479,13481.449999999999,479,43410.268999999993,479,40803.619999999995]
[480,3977.0277500000002,480,39433.241249999992,480,13481.449999999999,480,43410.268999999993,480,40803.619999999995]
[481,3977.0277500000002,481,39433.241249999992,481,13481.449999999999,481,43410.268999999993,481,40803.619999999995]
[482,3977.0277500000002,482,39433.241249999992,482,13481.449999999999,482,43410.268999999993,482,40803.619999999995]
[483,3977.0277500000002,483,39433.241249999992,483,13481.449999999999,483,43410.268999999993,483,40803.619999999995]
[484,3977.0277500000002,484,39433.241249999992,484,13481.449999999999,484,43410.268999999993,484,40803.619999999995]
[485,3977.0277500000002,485,39433.241249999992,485,13481.449999999999,485,43410.268999999993,485,40803.619999999995]
[486,3977.0277500000002,486,39433.241249999992,486,13481.449999999999,486,43410.268999999993,486,40803.619999999995]
[487,3977.0277500000002,487,39433.241249999992,487,13481.449999999999,487,43410.268999999993,487,40803.619999999995]
[488,3977.0277500000002,488,39433.241249999992,488,13481.449999999999,488,43410.268999999993,488,40803.619999999995]
[489,3977.0277500000002,489,39433.241249999992,489,13481.449999999999,489,43410.268999999993,489,40803.619999999995]
[490,3977.0277500000002,490,39433.241249999992,490,13481.449999999999,490,43410.268999999993,490,40803.619999999995]
[491,3977.0277500000002,491,39433.241249999992,491,13481.449999999999,491,43410.268999999993,491,40803.619999999995]
[492,3977.0277500000002,492,39433.241249999992,492,13481.449999999999,492,43410.268999999993,492,40803.619999999995]
[493,3977.0277500000002,493,39433.241249999992,493,13481.449999999999,493,43410.268999999993,493,40803.619999999995]
[494,3977.0277500000002,494,39433.241249999992,494,13481.449999999999,494,43410.268999999993,494,40803.619999999995]
[495,3977.0277500000002,495,39433.241249999992,495,13481.449999999999,495,43410.268999999993,495,40803.619999999995]
[496,3977.0277500000002,496,39433.241249999992,496,13481.449999999999,496,43410.268999999993,496,40803.619999999995]
[497,3977.0277500000002,497,39433.241249999992,497,13481.449999999999,497,43410.268999999993,497,40803.619999999995]
[498,3977.0277500000002,498,39433.241249999992,498,13481.449999999999,498,43410.268999999993,498,40803.619999999995]
[499,3977.0277500000002,499,39433.241249999992,499,13481.449999999999,499,43410.268999999993,499,40803.619999999995]
[500,3977.0277500000002,500,39433.241249999992,500,13481.449999999999,500,43410.268999999993,500,40803.619999999995]
[501,3977.0277500000002,501,39433.241249999992,501,13481.449999999999,501,43410.268999999993,501,40803.619999999995]
[502,3977.0277500000002,502,39433.241249999992,502,13481.449999999999,502,43410.268999999993,502,40803.619999999995]
[503,3977.0277500000002,503,39433.241249999992,503,13481.449999999999,503,43410.268999999993,503,40803.619999999995]
[504,3977.0277500000002,504,39433.241249999992,504,13481.449999999999,504,43410.268999999993,504,40803.619999999995]
[505,3977.0277500000002,505,39433.241249999992,505,13481.449999999999,505,43410.268999999993,505,40803.619999999995]
[506,3977.0277500000002,506,39433.241249999992,506,13481.449999999999,506,43410.268999999993,506,40803.619999999995]
[507,3977.0277500000002,507,39433.241249999992,507,13481.449999999999,507,43410.268999999993,507,40803.619999999995]
[508,3977.0277500000002,508,39433.241249999992,508,13481.449999999999,508,43410.268999999993,508,40803.619999999995]
[509,3977.0277500000002,509,39433.241249999992,509,13481.449999999999,509,43410.268999999993,509,40803.619999999995]
[510,3977.0277500000002,510,39433.241249999992,510,13481.449999999999,510,43410.268999999993,510,40803.619999999995]
[511,3977.0277500000002,511,39433.241249999992,511,13481.449999999999,511,43410.268999999993,511,40803.619999999995]
[512,3977.0277500000002,512,39433.241249999992,512,13481.449999999999,512,43410.268999999993,512,40803.619999999995]
[513,3977.0277500000002,513,39433.241249999992,513,13481.449999999999,513,43410.268999999993,513,40803.619999999995]
[514,3977.0277500000002,514,39433.241249999992,514,13481.449999999999,514,43410.268999999993,514,40803.619999999995]
[515,3977.0277500000002,515,39433.241249999992,515,13481.449999999999,515,43410.268999999993,515,40803.619999999995]
[516,3977.0277500000002,516,39433.241249999992,516,13481.449999999999,516,43410.268999999993,516,40803.619999999995]
[517,3977.0277500000002,517,39433.241249999992,517,13481.449999999999,517,43410.268999999993,517,40803.619999999995]
[518,3977.0277500000002,518,39433.241249999992,518,13481.449999999999,518,43410.268999999993,518,40803.619999999995]
[519,3977.0277500000002,519,39433.241249999992,519,13481.449999999999,519,43410.268999999993,519,40803.619999999995]
[520,3977.0277500000002,520,39433.241249999992,520,13481.449999999999,520,43410.268999999993,520,40803.619999999995]
[521,3977.0277500000002,521,39433.241249999992,521,13481.449999999999,521,43410.268999999993,521,40803.619999999995]
[522,3977.0277500000002,522,39433.241249999992,522,13481.449999999999,522,43410.268999999993,522,40803.619999999995]
[523,3977.0277500000002,523,39433.241249999992,523,13481.449999999999,523,43410.268999999993,523,40803.619999999995]
[524,3977.0277500000002,524,39433.241249999992,524,13481.449999999999,524,43410.268999999993,524,40803.619999999995]
[525,3977.0277500000002,525,39433.241249999992,525,13481.449999999999,525,43410.268999999993,525,40803.619999999995]
[526,3977.0277500000002,526,39433.241249999992,526,13481.449999999999,526,43410.268999999993,526,40803.619999999995]
[527,3977.0277500000002,527,39433.241249999992,527,13481.449999999999,527,43410.268999999993,527,40803.619999999995]
[528,3977.0277500000002,528,39433.241249999992,528,13481.449999999999,528,43410.268999999993,528,40803.619999999995]
[529,3977.0277500000002,529,39433.241249999992,529,13481.449999999999,529,43410.268999999993,529,40803.619999999995]
[530,3977.0277500000002,530,39433.241249999992,530,13481.449999999999,530,43410.268999999993,530,40803.619999999995]
[531,3977.0277500000002,531,39433.241249999992,531,13481.449999999999,531,43410.268999999993,531,40803.619999999995]
[532,3977.0277500000002,532,39433.241249999992,532,13481.449999999999,532,43410.268999999993,532,40803.619999999995]
[533,3977.0277500000002,533,39433.241249999992,533,13481.449999999999,533,43410.268999999993,533,40803.619999999995]
[534,3977.0277500000002,534,39433.241249999992,534,13481.449999999999,534,43410.268999999993,534,40803.619999999995]
[535,3977.0277500000002,535,39433.241249999992,535,13481.449999999999,535,43410.268999999993,535,40803.619999999995]
[536,3977.0277500000002,536,39433.241249999992,536,13481.449999999999,536,43410.268999999993,536,40803.619999999995]
[537,3977.0277500000002,537,39433.241249999992,537,13481.449999999999,537,43410.268999999993,537,40803.619999999995]
[538,3977.0277500000002,538,39433.241249999992,538,13481.449999999999,538,43410.268999999993,538,40803.619999999995]
[539,3977.0277500000002,539,39433.241249999992,539,13481.449999999999,539,43410.268999999993,539,40803.619999999995]
[540,3977.0277500000002,540,39433.241249999992,540,13481.449999999999,540,43410.268999999993,540,40803.619999999995]
[541,3977.0277500000002,541,39433.241249999992,541,13481.449999999999,541,43410.268999999993,541,40803.619999999995]
[542,3977.0277500000002,542,39433.241249999992,542,13481.449999999999,542,43410.268999999993,542,40803.619999999995]
[543,3977.0277500000002,543,39433.241249999992,543,13481.449999999999,543,43410.268999999993,543,40803.619999999995]
[544,3977.0277500000002,544,39433.241249999992,544,13481.449999999999,544,43410.268999999993,544,40803.619999999995]
[545,3977.0277500000002,545,39433.241249999992,545,13481.449999999999,545,43410.268999999993,545,40803.619999999995]
[546,3977.0277500000002,546,39433.241249999992,546,13481.449999999999,546,43410.268999999993,546,40803.619999999995]
[547,3977.0277500000002,547,39433.241249999992,547,13481.449999999999,547,43410.268999999993,547,40803.619999999995]
[548,3977.0277500000002,548,39433.241249999992,548,13481.449999999999,548,43410.268999999993,548,40803.619999999995]
[549,3977.0277500000002,549,39433.241249999992,549,13481.449999999999,549,43410.268999999993,549,40803.619999999995]
[550,3977.0277500000002,550,39433.241249999992,550,13481.449999999999,550,43410.268999999993,550,40803.619999999995]
[551,3977.0277500000002,551,39433.241249999992,551,13481.449999999999,551,43410.268999999993,551,40803.619999999995]
[552,3977.0277500000002,552,39433.241249999992,552,13481.449999999999,552,43410.268999999993,552,40803.619999999995]
[553,3977.0277500000002,553,39433.241249999992,553,13481.449999999999,553,43410.268999999993,553,40803.619999999995]
[554,3977.0277500000002,554,39433.241249999992,554,13481.449999999999,554,43410.268999999993,554,40803.619999999995]
[555,3977.0277500000002,555,39433.241249999992,555,13481.449999999999,555,43410.268999999993,555,40803.619999999995]
[556,3977.0277500000002,556,39433.241249999992,556,13481.449999999999,556,43410.268999999993,556,40803.619999999995]
[557,3977.0277500000002,557,39433.241249999992,557,13481.449999999999,557,43410.268999999993,557,40803.619999999995]
[558,3977.0277500000002,558,39433.241249999992,558,13481.449999999999,558,43410.268999999993,558,40803.619999999995]
[559,3977.0277500000002,559,39433.241249999992,559,13481.449999999999,559,43410.268999999993,559,40803.619999999995]
[560,3977.0277500000002,560,39433.241249999992,560,13481.449999999999,560,43410.268999999993,560,40803.619999999995]
[561,3977.0277500000002,561,39433.241249999992,561,13481.449999999999,561,43410.268999999993,561,40803.619999999995]
[562,3977.0277500000002,562,39433.241249999992,562,13481.449999999999,562,43410.268999999993,562,40803.619999999995]
[563,3977.0277500000002,563,39433.241249999992,563,13481.449999999999,563,43410.268999999993,563,40803.619999999995]
[564,3977.0277500000002,564,39433.241249999992,564,13481.449999999999,564,43410.268999999993,564,40803.619999999995]
[565,3977.0277500000002,565,39433.241249999992,565,13481.449999999999,565,43410.268999999993,565,40803.619999999995]
[566,3977.0277500000002,566,39433.241249999992,566,13481.449999999999,566,43410.268999999993,566,40803.619999999995]
[567,3977.0277500000002,567,39433.241249999992,567,13481.449999999999,567,43410.268999999993,567,40803.619999999995]
[568,3977.0277500000002,568,39433.241249999992,568,13481.449999999999,568,43410.268999999993,568,40803.619999999995]
[569,3977.0277500000002,569,39433.241249999992,569,13481.449999999999,569,43410.268999999993,569,40803.619999999995]
[570,3977.0277500000002,570,39433.241249999992,570,13481.449999999999,570,43410.268999999993,570,40803.619999999995]
[571,3977.0277500000002,571,39433.241249999992,571,13481.449999999999,571,43410.268999999993,571,40803.619999999995]
[572,3977.0277500000002,572,39433.241249999992,572,13481.449999999999,572,43410.268999999993,572,40803.619999999995]
[573,3977.0277500000002,573,39433.241249999992,573,13481.449999999999,573,43410.268999999993,573,40803.619999999995]
[574,3977.0277500000002,574,39433.241249999992,574,13481.449999999999,574,43410.268999999993,574,40803.619999999995]
[575,3977.0277500000002,575,39433.241249999992,575,13481.449999999999,575,43410.268999999993,575,40803.619999999995]
[576,3977.0277500000002,576,39433.241249999992,576,13481.449999999999,576,43410.268999999993,576,40803.619999999995]
[577,3977.0277500000002,577,39433.241249999992,577,13481.449999999999,577,43410.268999999993,577,40803.619999999995]
[578,3977.0277500000002,578,39433.241249999992,578,13481.449999999999,578,43410.268999999993,578,40803.619999999995]
[579,3977.0277500000002,579,39433.241249999992,579,13481.449999999999,579,43410.268999999993,579,40803.619999999995]
[580,3977.0277500000002,580,39433.241249999992,580,13481.449999999999,580,43410.268999999993,580,40803.619999999995]
[581,3977.0277500000002,581,39433.241249999992,581,13481.449999999999,581,43410.268999999993,581,40803.619999999995]
[582,3977.0277500000002,582,39433.241249999992,582,13481.449999999999,582,43410.268999999993,582,40803.619999999995]
[583,3977.0277500000002,583,39433.241249999992,583,13481.449999999999,583,43410.268999999993,583,40803.619999999995]
[584,3977.0277500000002,584,39433.241249999992,584,13481.449999999999,584,43410.268999999993,584,40803.619999999995]
[585,3977.0277500000002,585,39433.241249999992,585,13481.449999999999,585,43410.268999999993,585,40803.619999999995]
[586,3977.0277500000002,586,39433.241249999992,586,13481.449999999999,586,43410.268999999993,586,40803.619999999995]
[587,3977.0277500000002,587,39433.241249999992,587,13481.449999999999,587,43410.268999999993,587,40803.619999999995]
[588,3977.0277500000002,588,39433.241249999992,588,13481.449999999999,588,43410.268999999993,588,40803.619999999995]
[589,3977.0277500000002,589,39433.241249999992,589,13481.449999999999,589,43410.268999999993,589,40803.619999999995]
[590,3977.0277500000002,590,39433.241249999992,590,13481.449999999999,590,43410.268999999993,590,40803.619999999995]
[591,3977.0277500000002,591,39433.241249999992,591,13481.449999999999,591,43410.268999999993,591,40803.619999999995]
[592,3977.0277500000002,592,39433.241249999992,592,13481.449999999999,592,43410.268999999993,592,40803.619999999995]
[593,3977.0277500000002,593,39433.241249999992,593,13481.449999999999,593,43410.268999999993,593,40803.619999999995]
[594,3977.0277500000002,594,39433.241249999992,594,13481.449999999999,594,43410.268999999993,594,40803.619999999995]
[595,3977.0277500000002,595,39433.241249999992,595,13481.449999999999,595,43410.268999999993,595,40803.619999999995]
[596,3977.0277500000002,596,39433.241249999992,596,13481.449999999999,596,43410.268999999993,596,40803.619999999995]
[597,3977.0277500000002,597,39433.241249999992,597,13481.449999999999,597,43410.268999999993,597,40803.619999999995]
[598,3977.0277500000002,598,39433.241249999992,598,13481.449999999999,598,43410.268999999993,598,40803.619999999995]
[599,3977.0277500000002,599,39433.241249999992,599,13481.449999999999,599,43410.268999999993,599,40803.619999999995]
[600,3977.0277500000002,600,39433.241249999992,600,13481.449999999999,600,43410.268999999993,600,40803.619999999995]
[601,3977.0277500000002,601,39433.241249999992,601,13481.449999999999,601,43410.268999999993,601,40803.619999999995]
[602,3977.0277500000002,602,39433.241249999992,602,13481.449999999999,602,43410.268999999993,602,40803.619999999995]
[603,3977.0277500000002,603,39433.241249999992,603,13481.449999999999,603,43410.268999999993,603,40803.619999999995]
[604,3977.0277500000002,604,39433.241249999992,604,13481.449999999999,604,43410.268999999993,604,40803.619999999995]
[605,3977.0277500000002,605,39433.241249999992,605,13481.449999999999,605,43410.268999999993,605,40803.619999999995]
[606,3977.0277500000002,606,39433.241249999992,606,13481.449999999999,606,43410.268999999993,606,40803.619999999995]
[607,3977.0277500000002,607,39433.241249999992,607,13481.449999999999,607,43410.268999999993,607,40803.619999999995]
[608,3977.0277500000002,608,39433.241249999992,608,13481.449999999999,608,43410.268999999993,608,40803.619999999995]
[609,3977.0277500000002,609,39433.241249999992,609,13481.449999999999,609,43410.268999999993,609,40803.619999999995]
[610,3977.0277500000002,610,39433.241249999992,610,13481.449999999999,610,43410.268999999993,610,40803.619999999995]
[611,3977.0277500000002,611,39433.241249999992,611,13481.449999999999,611,43410.268999999993,611,40803.619999999995]
[612,3977.0277500000002,612,39433.241249999992,612,13481.449999999999,612,43410.268999999993,612,40803.619999999995]
[613,3977.0277500000002,613,39433.241249999992,613,13481.449999999999,613,43410.268999999993,613,40803.619999999995]
[614,3977.0277500000002,614,39433.241249999992,614,13481.449999999999,614,43410.268999999993,614,40803.619999999995]
[615,3977.0277500000002,615,39433.241249999992,615,13481.449999999999,615,43410.268999999993,615,40803.619999999995]
[616,3977.0277500000002,616,39433.241249999992,616,13481.449999999999,616,43410.268999999993,616,40803.619999999995]
[617,3977.0277500000002,617,39433.241249999992,617,13481.449999999999,617,43410.268999999993,617,40803.619999999995]
[618,3977.0277500000002,618,39433.241249999992,618,13481.449999999999,618,43410.268999999993,618,40803.619999999995]
[619,3977.0277500000002,619,39433.241249999992,619,13481.449999999999,619,43410.268999999993,619,40803.619999999995]
[620,3977.0277500000002,620,39433.241249999992,620,13481.449999999999,620,43410.268999999993,620,40803.619999999995]
[621,3977.0277500000002,621,39433.241249999992,621,13481.449999999999,621,43410.268999999993,621,40803.619999999995]
[622,3977.0277500000002,622,39433.241249999992,622,13481.449999999999,622,43410.268999999993,622,40803.619999999995]
[623,3977.0277500000002,623,39433.241249999992,623,13481.449999999999,623,43410.268999999993,623,40803.619999999995]
[624,3977.0277500000002,624,39433.241249999992,624,13481.449999999999,624,43410.268999999993,624,40803.619999999995]
[625,3977.0277500000002,625,39433.241249999992,625,13481.449999999999,625,43410.268999999993,625,40803.619999999995]
[626,3977.0277500000002,626,39433.241249999992,626,13481.449999999999,626,43410.268999999993,626,40803.619999999995]
[627,3977.0277500000002,627,39433.241249999992,627,13481.449999999999,627,43410.268999999993,627,40803.619999999995]
[628,3977.0277500000002,628,39433.241249999992,628,13481.449999999999,628,43410.268999999993,628,40803.619999999995]
[629,3977.0277500000002,629,39433.241249999992,629,13481.449999999999,629,43410.268999999993,629,40803.619999999995]
[630,3977.0277500000002,630,39433.241249999992,630,13481.449999999999,630,43410.268999999993,630,40803.619999999995]
[631,3977.0277500000002,631,39433.241249999992,631,13481.449999999999,631,43410.268999999993,631,40803.619999999995]
[632,3977.0277500000002,632,39433.241249999992,632,13481.449999999999,632,43410.268999999993,632,40803.619999999995]
[633,3977.0277500000002,633,39433.241249999992,633,13481.449999999999,633,43410.268999999993,633,40803.619999999995]
[634,3977.0277500000002,634,39433.241249999992,634,13481.449999999999,634,43410.268999999993,634,40803.619999999995]
[635,3977.0277500000002,635,39433.241249999992,635,13481.449999999999,635,43410.268999999993,635,40803.619999999995]
[636,3977.0277500000002,636,39433.241249999992,636,13481.449999999999,636,43410.268999999993,636,40803.619999999995]
[637,3977.0277500000002,637,39433.241249999992,637,13481.449999999999,637,43410.268999999993,637,40803.619999999995]
[638,3977.0277500000002,638,39433.241249999992,638,13481.449999999999,638,43410.268999999993,638,40803.619999999995]
[639,3977.0277500000002,639,39433.241249999992,639,13481.449999999999,639,43410.268999999993,639,40803.619999999995]
[640,3977.0277500000002,640,39433.241249999992,640,13481.449999999999,640,43410.268999999993,640,40803.619999999995]
[641,3977.0277500000002,641,39433.241249999992,641,13481.449999999999,641,43410.268999999993,641,40803.619999999995]
[642,3977.0277500000002,642,39433.241249999992,642,13481.449999999999,642,43410.268999999993,642,40803.619999999995]
[643,3977.0277500000002,643,39433.241249999992,643,13481.449999999999,643,43410.268999999993,643,40803.619999999995]
[644,3977.0277500000002,644,39433.241249999992,644,13481.449999999999,644,43410.268999999993,644,40803.619999999995]
[645,3977.0277500000002,645,39433.241249999992,645,13481.449999999999,645,43410.268999999993,645,40803.619999999995]
[646,3977.0277500000002,646,39433.241249999992,646,13481.449999999999,646,43410.268999999993,646,40803.619999999995]
[647,3977.0277500000002,647,39433.241249999992,647,13481.449999999999,647,43410.268999999993,647,40803.619999999995]
[648,3977.0277500000002,648,39433.241249999992,648,13481.449999999999,648,43410.268999999993,648,40803.619999999995]
[649,3977.0277500000002,649,39433.241249999992,649,13481.449999999999,649,43410.268999999993,649,40803.619999999995]
[650,3977.0277500000002,650,39433.241249999992,650,13481.449999999999,650,43410.268999999993,650,40803.619999999995]
[651,3977.0277500000002,651,39433.241249999992,651,13481.449999999999,651,43410.268999999993,651,40803.619999999995]
[652,3977.0277500000002,652,39433.241249999992,652,13481.449999999999,652,43410.268999999993,652,40803.619999999995]
[653,3977.0277500000002,653,39433.241249999992,653,13481.449999999999,653,43410.268999999993,653,40803.619999999995]
[654,3977.0277500000002,654,39433.241249999992,654,13481.449999999999,654,43410.268999999993,654,40803.619999999995]
[655,3977.0277500000002,655,39433.241249999992,655,13481.449999999999,655,43410.268999999993,655,40803.619999999995]
[656,3977.0277500000002,656,39433.241249999992,656,13481.449999999999,656,43410.268999999993,656,40803.619999999995]
[657,3977.0277500000002,657,39433.241249999992,657,13481.449999999999,657,43410.268999999993,657,40803.619999999995]
[658,3977.0277500000002,658,39433.241249999992,658,13481.449999999999,658,43410.268999999993,658,40803.619999999995]
[659,3977.0277500000002,659,39433.241249999992,659,13481.449999999999,659,43410.268999999993,659,40803.619999999995]
[660,3977.0277500000002,660,39433.241249999992,660,13481.449999999999,660,43410.268999999993,660,40803.619999999995]
[661,3977.0277500000002,661,39433.241249999992,661,13481.449999999999,661,43410.268999999993,661,40803.619999999995]
[662,3977.0277500000002,662,39433.241249999992,662,13481.449999999999,662,43410.268999999993,662,40803.619999999995]
[663,3977.0277500000002,663,39433.241249999992,663,13481.449999999999,663,43410.268999999993,663,40803.619999999995]
[664,3977.0277500000002,664,39433.241249999992,664,13481.449999999999,664,43410.268999999993,664,40803.619999999995]
[665,3977.0277500000002,665,39433.241249999992,665,13481.449999999999,665,43410.268999999993,665,40803.619999999995]
[666,3977.0277500000002,666,39433.241249999992,666,13481.449999999999,666,43410.268999999993,666,40803.619999999995]
[667,3977.0277500000002,667,39433.241249999992,667,13481.449999999999,667,43410.268999999993,667,40803.619999999995]
[668,3977.0277500000002,668,39433.241249999992,668,13481.449999999999,668,43410.268999999993,668,40803.619999999995]
[669,3977.0277500000002,669,39433.241249999992,669,13481.449999999999,669,43410.268999999993,669,40803.619999999995]
[670,3977.0277500000002,670,39433.241249999992,670,13481.449999999999,670,43410.268999999993,670,40803.619999999995]
[671,3977.0277500000002,671,39433.241249999992,671,13481.449999999999,671,43410.268999999993,671,40803.619999999995]
[672,3977.0277500000002,672,39433.241249999992,672,13481.449999999999,672,43410.268999999993,672,40803.619999999995]
[673,3977.0277500000002,673,39433.241249999992,673,13481.449999999999,673,43410.268999999993,673,40803.619999999995]
[674,3977.0277500000002,674,39433.241249999992,674,13481.449999999999,674,43410.268999999993,674,40803.619999999995]
[675,3977.0277500000002,675,39433.241249999992,675,13481.449999999999,675,43410.268999999993,675,40803.619999999995]
[676,3977.0277500000002,676,39433.241249999992,676,13481.449999999999,676,43410.268999999993,676,40803.619999999995]
[677,3977.0277500000002,677,39433.241249999992,677,13481.449999999999,677,43410.268999999993,677,40803.619999999995]
[678,3977.0277500000002,678,39433.241249999992,678,13481.449999999999,678,43410.268999999993,678,40803.619999999995]
[679,3977.0277500000002,679,39433.241249999992,679,13481.449999999999,679,43410.268999999993,679,40803.619999999995]
[680,3977.0277500000002,680,39433.241249999992,680,13481.449999999999,680,43410.268999999993,680,40803.619999999995]
[681,3977.0277500000002,681,39433.241249999992,681,13481.449999999999,681,43410.268999999993,681,40803.619999999995]
[682,3977.0277500000002,682,39433.241249999992,682,13481.449999999999,682,43410.268999999993,682,40803.619999999995]
[683,3977.0277500000002,683,39433.241249999992,683,13481.449999999999,683,43410.268999999993,683,40803.619999999995]
[684,3977.0277500000002,684,39433.241249999992,684,13481.449999999999,684,43410.268999999993,684,40803.619999999995]
[685,3977.0277500000002,685,39433.241249999992,685,13481.449999999999,685,43410.268999999993,685,40803.619999999995]
[686,3977.0277500000002,686,39433.241249999992,686,13481.449999999999,686,43410.268999999993,686,40803.619999999995]
[687,3977.0277500000002,687,39433.241249999992,687,13481.449999999999,687,43410.268999999993,687,40803.619999999995]
[688,3977.0277500000002,688,39433.241249999992,688,13481.449999999999,688,43410.268999999993,688,40803.619999999995]
[689,3977.0277500000002,689,39433.241249999992,689,13481.449999999999,689,43410.268999999993,689,40803.619999999995]
[690,3977.0277500000002,690,39433.241249999992,690,13481.449999999999,690,43410.268999999993,690,40803.619999999995]
[691,3977.0277500000002,691,39433.241249999992,691,13481.449999999999,691,43410.268999999993,691,40803.619999999995]
[692,3977.0277500000002,692,39433.241249999992,692,13481.449999999999,692,43410.268999999993,692,40803.619999999995]
[693,3977.0277500000002,693,39433.241249999992,693,13481.449999999999,693,43410.268999999993,693,40803.619999999995]
[694,3977.0277500000002,694,39433.241249999992,694,13481.449999999999,694,43410.268999999993,694,40803.619999999995]
[695,3977.0277500000002,695,39433.241249999992,695,13481.449999999999,695,43410.268999999993,695,40803.619999999995]
[696,3977.0277500000002,696,39433.241249999992,696,13481.449999999999,696,43410.268999999993,696,40803.619999999995]
[697,3977.0277500000002,697,39433.241249999992,697,13481.449999999999,697,43410.268999999993,697,40803.619999999995]
[698,3977.0277500000002,698,39433.241249999992,698,13481.449999999999,698,43410.268999999993,698,40803.619999999995]
[699,3977.0277500000002,699,39433.241249999992,699,13481.449999999999,699,43410.268999999993,699,40803.619999999995]
[700,3977.0277500000002,700,39433.241249999992,700,13481.449999999999,700,43410.268999999993,700,40803.619999999995]
[701,3977.0277500000002,701,39433.241249999992,701,13481.449999999999,701,43410.268999999993,701,40803.619999999995]
[702,3977.0277500000002,702,39433.241249999992,702,13481.449999999999,702,43410.268999999993,702,40803.619999999995]
[703,3977.0277500000002,703,39433.241249999992,703,13481.449999999999,703,43410.268999999993,703,40803.619999999995]
[704,3977.0277500000002,704,39433.241249999992,704,13481.449999999999,704,43410.268999999993,704,40803.619999999995]
[705,3977.0277500000002,705,39433.241249999992,705,13481.449999999999,705,43410.268999999993,705,40803.619999999995]
[706,3977.0277500000002,706,39433.241249999992,706,13481.449999999999,706,43410.268999999993,706,40803.619999999995]
[707,3977.0277500000002,707,39433.241249999992,707,13481.449999999999,707,43410.268999999993,707,40803.619999999995]
[708,3977.0277500000002,708,39433.241249999992,708,13481.449999999999,708,43410.268999999993,708,40803.619999999995]
[709,3977.0277500000002,709,39433.241249999992,709,13481.449999999999,709,43410.268999999993,709,40803.619999999995]
[710,3977.0277500000002,710,39433.241249999992,710,13481.449999999999,710,43410.268999999993,710,40803.619999999995]
[711,3977.0277500000002,711,39433.241249999992,711,13481.449999999999,711,43410.268999999993,711,40803.619999999995]
[712,3977.0277500000002,712,39433.241249999992,712,13481.449999999999,712,43410.268999999993,712,40803.619999999995]
[713,3977.0277500000002,713,39433.241249999992,713,13481.449999999999,713,43410.268999999993,713,40803.619999999995]
[714,3977.0277500000002,714,39433.241249999992,714,13481.449999999999,714,43410.268999999993,714,40803.619999999995]
[715,3977.0277500000002,715,39433.241249999992,715,13481.449999999999,715,43410.268999999993,715,40803.619999999995]
[716,3977.0277500000002,716,39433.241249999992,716,13481.449999999999,716,43410.268999999993,716,40803.619999999995]
[717,3977.0277500000002,717,39433.241249999992,717,13481.449999999999,717,43410.268999999993,717,40803.619999999995]
[718,3977.0277500000002,718,39433.241249999992,718,13481.449999999999,718,43410.268999999993,718,40803.619999999995]
[719,3977.0277500000002,719,39433.241249999992,719,13481.449999999999,719,43410.268999999993,719,40803.619999999995]
[720,3977.0277500000002,720,39433.241249999992,720,13481.449999999999,720,43410.268999999993,720,40803.619999999995]
[721,3977.0277500000002,721,39433.241249999992,721,13481.449999999999,721,43410.268999999993,721,40803.619999999995]
[722,3977.0277500000002,722,39433.241249999992,722,13481.449999999999,722,43410.268999999993,722,40803.619999999995]
[723,3977.0277500000002,723,39433.241249999992,723,13481.449999999999,723,43410.268999999993,723,40803.619999999995]
[724,3977.0277500000002,724,39433.241249999992,724,13481.449999999999,724,43410.268999999993,724,40803.619999999995]
[725,3977.0277500000002,725,39433.241249999992,725,13481.449999999999,725,43410.268999999993,725,40803.619999999995]
[726,3977.0277500000002,726,39433.241249999992,726,13481.449999999999,726,43410.268999999993,726,40803.619999999995]
[727,3977.0277500000002,727,39433.241249999992,727,13481.449999999999,727,43410.268999999993,727,40803.619999999995]
[728,3977.0277500000002,728,39433.241249999992,728,13481.449999999999,728,43410.268999999993,728,40803.619999999995]
[729,3977.0277500000002,729,39433.241249999992,729,13481.449999999999,729,43410.268999999993,729,40803.619999999995]
[730,3977.0277500000002,730,39433.241249999992,730,13481.449999999999,730,43410.268999999993,730,40803.619999999995]
[731,3977.0277500000002,731,39433.241249999992,731,13481.449999999999,731,43410.268999999993,731,40803.619999999995]
[732,3977.0277500000002,732,39433.241249999992,732,13481.449999999999,732,43410.268999999993,732,40803.619999999995]
[733,3977.0277500000002,733,39433.241249999992,733,13481.449999999999,733,43410.268999999993,733,40803.619999999995]
[734,3977.0277500000002,734,39433.241249999992,734,13481.449999999999,734,43410.268999999993,734,40803.619999999995]
[735,3977.0277500000002,735,39433.241249999992,735,13481.449999999999,735,43410.268999999993,735,40803.619999999995]
[736,3977.0277500000002,736,39433.241249999992,736,13481.449999999999,736,43410.268999999993,736,40803.619999999995]
[737,3977.0277500000002,737,39433.241249999992,737,13481.449999999999,737,43410.268999999993,737,40803.619999999995]
[738,3977.0277500000002,738,39433.241249999992,738,13481.449999999999,738,43410.268999999993,738,40803.619999999995]
[739,3977.0277500000002,739,39433.241249999992,739,13481.449999999999,739,43410.268999999993,739,40803.619999999995]
[740,3977.0277500000002,740,39433.241249999992,740,13481.449999999999,740,43410.268999999993,740,40803.619999999995]
[741,3977.0277500000002,741,39433.241249999992,741,13481.449999999999,741,43410.268999999993,741,40803.619999999995]
[742,3977.0277500000002,742,39433.241249999992,742,13481.449999999999,742,43410.268999999993,742,40803.619999999995]
[743,3977.0277500000002,743,39433.241249999992,743,13481.449999999999,743,43410.268999999993,743,40803.619999999995]
[744,3977.0277500000002,744,39433.241249999992,744,13481.449999999999,744,43410.268999999993,744,40803.619999999995]
[745,3977.0277500000002,745,39433.241249999992,745,13481.449999999999,745,43410.268999999993,745,40803.619999999995]
[746,3977.0277500000002,746,39433.241249999992,746,13481.449999999999,746,43410.268999999993,746,40803.619999999995]
[747,3977.0277500000002,747,39433.241249999992,747,13481.449999999999,747,43410.268999999993,747,40803.619999999995]
[748,3977.0277500000002,748,39433.241249999992,748,13481.449999999999,748,43410.268999999993,748,40803.619999999995]
[749,3977.0277500000002,749,39433.241249999992,749,13481.449999999999,749,43410.268999999993,749,40803.619999999995]
[750,3977.0277500000002,750,39433.241249999992,750,13481.449999999999,750,43410.268999999993,750,40803.619999999995]
[751,3977.0277500000002,751,39433.241249999992,751,13481.449999999999,751,43410.268999999993,751,40803.619999999995]
[752,3977.0277500000002,752,39433.241249999992,752,13481.449999999999,752,43410.268999999993,752,40803.619999999995]
[753,3977.0277500000002,753,39433.241249999992,753,13481.449999999999,753,43410.268999999993,753,40803.619999999995]
[754,3977.0277500000002,754,39433.241249999992,754,13481.449999999999,754,43410.268999999993,754,40803.619999999995]
[755,3977.0277500000002,755,39433.241249999992,755,13481.449999999999,755,43410.268999999993,755,40803.619999999995]
[756,3977.0277500000002,756,39433.241249999992,756,13481.449999999999,756,43410.268999999993,756,40803.619999999995]
[757,3977.0277500000002,757,39433.241249999992,757,13481.449999999999,757,43410.268999999993,757,40803.619999999995]
[758,3977.0277500000002,758,39433.241249999992,758,13481.449999999999,758,43410.268999999993,758,40803.619999999995]
[759,3977.0277500000002,759,39433.241249999992,759,13481.449999999999,759,43410.268999999993,759,40803.619999999995]
[760,3977.0277500000002,760,39433.241249999992,760,13481.449999999999,760,43410.268999999993,760,40803.619999999995]
[761,3977.0277500000002,761,39433.241249999992,761,13481.449999999999,761,43410.268999999993,761,40803.619999999995]
[762,3977.0277500000002,762,39433.241249999992,762,13481.449999999999,762,43410.268999999993,762,40803.619999999995]
[763,3977.0277500000002,763,39433.241249999992,763,13481.449999999999,763,43410.268999999993,763,40803.619999999995]
[764,3977.0277500000002,764,39433.241249999992,764,13481.449999999999,764,43410.268999999993,764,40803.619999999995]
[765,3977.0277500000002,765,39433.241249999992,765,13481.449999999999,765,43410.268999999993,765,40803.619999999995]
[766,3977.0277500000002,766,39433.241249999992,766,13481.449999999999,766,43410.268999999993,766,40803.619999999995]
[767,3977.0277500000002,767,39433.241249999992,767,13481.449999999999,767,43410.268999999993,767,40803.619999999995]
[768,3977.0277500000002,768,39433.241249999992,768,13481.449999999999,768,43410.268999999993,768,40803.619999999995]
[769,3977.0277500000002,769,39433.241249999992,769,13481.449999999999,769,43410.268999999993,769,40803.619999999995]
[770,3977.0277500000002,770,39433.241249999992,770,13481.449999999999,770,43410.268999999993,770,40803.619999999995]
[771,3977.0277500000002,771,39433.241249999992,771,13481.449999999999,771,43410.268999999993,771,40803.619999999995]
[772,3977.0277500000002,772,39433.241249999992,772,13481.449999999999,772,43410.268999999993,772,40803.619999999995]
[773,3977.0277500000002,773,39433.241249999992,773,13481.449999999999,773,43410.268999999993,773,40803.619999999995]
[774,3977.0277500000002,774,39433.241249999992,774,13481.449999999999,774,43410.268999999993,774,40803.619999999995]
[775,3977.0277500000002,775,39433.241249999992,775,13481.449999999999,775,43410.268999999993,775,40803.619999999995]
[776,3977.0277500000002,776,39433.241249999992,776,13481.449999999999,776,43410.268999999993,776,40803.619999999995]
[777,3977.0277500000002,777,39433.241249999992,777,13481.449999999999,777,43410.268999999993,777,40803.619999999995]
[778,3977.0277500000002,778,39433.241249999992,778,13481.449999999999,778,43410.268999999993,778,40803.619999999995]
[779,3977.0277500000002,779,39433.241249999992,779,13481.449999999999,779,43410.268999999993,779,40803.619999999995]
[780,3977.0277500000002,780,39433.241249999992,780,13481.449999999999,780,43410.268999999993,780,40803.619999999995]
[781,3977.0277500000002,781,39433.241249999992,781,13481.449999999999,781,43410.268999999993,781,40803.619999999995]
[782,3977.0277500000002,782,39433.241249999992,782,13481.449999999999,782,43410.268999999993,782,40803.619999999995]
[783,3977.0277500000002,783,39433.241249999992,783,13481.449999999999,783,43410.268999999993,783,40803.619999999995]
[784,3977.0277500000002,784,39433.241249999992,784,13481.449999999999,784,43410.268999999993,784,40803.619999999995]
[785,3977.0277500000002,785,39433.241249999992,785,13481.449999999999,785,43410.268999999993,785,40803.619999999995]
[786,3977.0277500000002,786,39433.241249999992,786,13481.449999999999,786,43410.268999999993,786,40803.619999999995]
[787,3977.0277500000002,787,39433.241249999992,787,13481.449999999999,787,43410.268999999993,787,40803.619999999995]
[788,3977.0277500000002,788,39433.241249999992,788,13481.449999999999,788,43410.268999999993,788,40803.619999999995]
[789,3977.0277500000002,789,39433.241249999992,789,13481.449999999999,789,43410.268999999993,789,40803.619999999995]
[790,3977.0277500000002,790,39433.241249999992,790,13481.449999999999,790,43410.268999999993,790,40803.619999999995]
[791,3977.0277500000002,791,39433.241249999992,791,13481.449999999999,791,43410.268999999993,791,40803.619999999995]
[792,3977.0277500000002,792,39433.241249999992,792,13481.449999999999,792,43410.268999999993,792,40803.619999999995]
[793,3977.0277500000002,793,39433.241249999992,793,13481.449999999999,793,43410.268999999993,793,40803.619999999995]
[794,3977.0277500000002,794,39433.241249999992,794,13481.449999999999,794,43410.268999999993,794,40803.619999999995]
[795,3977.0277500000002,795,39433.241249999992,795,13481.449999999999,795,43410.268999999993,795,40803.619999999995]
[796,3977.0277500000002,796,39433.241249999992,796,13481.449999999999,796,43410.268999999993,796,40803.619999999995]
[797,3977.0277500000002,797,39433.241249999992,797,13481.449999999999,797,43410.268999999993,797,40803.619999999995]
[798,3977.0277500000002,798,39433.241249999992,798,13481.449999999999,798,43410.268999999993,798,40803.619999999995]
[799,3977.0277500000002,799,39433.241249999992,799,13481.449999999999,799,43410.268999999993,799,40803.619999999995]
[800,3977.0277500000002,800,39433.241249999992,800,13481.449999999999,800,43410.268999999993,800,40803.619999999995]
[801,3977.0277500000002,801,39433.241249999992,801,13481.449999999999,801,43410.268999999993,801,40803.619999999995]
[802,3977.0277500000002,802,39433.241249999992,802,13481.449999999999,802,43410.268999999993,802,40803.619999999995]
[803,3977.0277500000002,803,39433.241249999992,803,13481.449999999999,803,43410.268999999993,803,40803.619999999995]
[804,3977.0277500000002,804,39433.241249999992,804,13481.449999999999,804,43410.268999999993,804,40803.619999999995]
[805,3977.0277500000002,805,39433.241249999992,805,13481.449999999999,805,43410.268999999993,805,40803.619999999995]
[806,3977.0277500000002,806,39433.241249999992,806,13481.449999999999,806,43410.268999999993,806,40803.619999999995]
[807,3977.0277500000002,807,39433.241249999992,807,13481.449999999999,807,43410.268999999993,807,40803.619999999995]
[808,3977.0277500000002,808,39433.241249999992,808,13481.449999999999,808,43410.268999999993,808,40803.619999999995]
[809,3977.0277500000002,809,39433.241249999992,809,13481.449999999999,809,43410.268999999993,809,40803.619999999995]
[810,3977.0277500000002,810,39433.241249999992,810,13481.449999999999,810,43410.268999999993,810,40803.619999999995]
[811,3977.0277500000002,811,39433.241249999992,811,13481.449999999999,811,43410.268999999993,811,40803.619999999995]
[812,3977.0277500000002,812,39433.241249999992,812,13481.449999999999,812,43410.268999999993,812,40803.619999999995]
[813,3977.0277500000002,813,39433.241249999992,813,13481.449999999999,813,43410.268999999993,813,40803.619999999995]
[814,3977.0277500000002,814,39433.241249999992,814,13481.449999999999,814,43410.268999999993,814,40803.619999999995]
[815,3977.0277500000002,815,39433.241249999992,815,13481.449999999999,815,43410.268999999993,815,40803.619999999995]
[816,3977.0277500000002,816,39433.241249999992,816,13481.449999999999,816,43410.268999999993,816,40803.619999999995]
[817,3977.0277500000002,817,39433.241249999992,817,13481.449999999999,817,43410.268999999993,817,40803.619999999995]
[818,3977.0277500000002,818,39433.241249999992,818,13481.449999999999,818,43410.268999999993,818,40803.619999999995]
[819,3977.0277500000002,819,39433.241249999992,819,13481.449999999999,819,43410.268999999993,819,40803.619999999995]
[820,3977.0277500000002,820,39433.241249999992,820,13481.449999999999,820,43410.268999999993,820,40803.619999999995]
[821,3977.0277500000002,821,39433.241249999992,821,13481.449999999999,821,43410.268999999993,821,40803.619999999995]
[822,3977.0277500000002,822,39433.241249999992,822,13481.449999999999,822,43410.268999999993,822,40803.619999999995]
[823,3977.0277500000002,823,39433.241249999992,823,13481.449999999999,823,43410.268999999993,823,40803.619999999995]
[824,3977.0277500000002,824,39433.241249999992,824,13481.449999999999,824,43410.268999999993,824,40803.619999999995]
[825,3977.0277500000002,825,39433.241249999992,825,13481.449999999999,825,43410.268999999993,825,40803.619999999995]
[826,3977.0277500000002,826,39433.241249999992,826,13481.449999999999,826,43410.268999999993,826,40803.619999999995]
[827,3977.0277500000002,827,39433.241249999992,827,13481.449999999999,827,43410.268999999993,827,40803.619999999995]
[828,3977.0277500000002,828,39433.241249999992,828,13481.449999999999,828,43410.268999999993,828,40803.619999999995]
[829,3977.0277500000002,829,39433.241249999992,829,13481.449999999999,829,43410.268999999993,829,40803.619999999995]
[830,3977.0277500000002,830,39433.241249999992,830,13481.449999999999,830,43410.268999999993,830,40803.619999999995]
[831,3977.0277500000002,831,39433.241249999992,831,13481.449999999999,831,43410.268999999993,831,40803.619999999995]
[832,3977.0277500000002,832,39433.241249999992,832,13481.449999999999,832,43410.268999999993,832,40803.619999999995]
[833,3977.0277500000002,833,39433.241249999992,833,13481.449999999999,833,43410.268999999993,833,40803.619999999995]
[834,3977.0277500000002,834,39433.241249999992,834,13481.449999999999,834,43410.268999999993,834,40803.619999999995]
[835,3977.0277500000002,835,39433.241249999992,835,13481.449999999999,835,43410.268999999993,835,40803.619999999995]
[836,3977.0277500000002,836,39433.241249999992,836,13481.449999999999,836,43410.268999999993,836,40803.619999999995]
[837,3977.0277500000002,837,39433.241249999992,837,13481.449999999999,837,43410.268999999993,837,40803.619999999995]
[838,3977.0277500000002,838,39433.241249999992,838,13481.449999999999,838,43410.268999999993,838,40803.619999999995]
[839,3977.0277500000002,839,39433.241249999992,839,13481.449999999999,839,43410.268999999993,839,40803.619999999995]
[840,3977.0277500000002,840,39433.241249999992,840,13481.449999999999,840,43410.268999999993,840,40803.619999999995]
[841,3977.0277500000002,841,39433.241249999992,841,13481.449999999999,841,43410.268999999993,841,40803.619999999995]
[842,3977.0277500000002,842,39433.241249999992,842,13481.449999999999,842,43410.268999999993,842,40803.619999999995]
[843,3977.0277500000002,843,39433.241249999992,843,13481.449999999999,843,43410.268999999993,843,40803.619999999995]
[844,3977.0277500000002,844,39433.241249999992,844,13481.449999999999,844,43410.268999999993,844,40803.619999999995]
[845,3977.0277500000002,845,39433.241249999992,845,13481.449999999999,845,43410.268999999993,845,40803.619999999995]
[846,3977.0277500000002,846,39433.241249999992,846,13481.449999999999,846,43410.268999999993,846,40803.619999999995]
[847,3977.0277500000002,847,39433.241249999992,847,13481.449999999999,847,43410.268999999993,847,40803.619999999995]
[848,3977.0277500000002,848,39433.241249999992,848,13481.449999999999,848,43410.268999999993,848,40803.619999999995]
[849,3977.0277500000002,849,39433.241249999992,849,13481.449999999999,849,43410.268999999993,849,40803.619999999995]
[850,3977.0277500000002,850,39433.241249999992,850,13481.449999999999,850,43410.268999999993,850,40803.619999999995]
[851,3977.0277500000002,851,39433.241249999992,851,13481.449999999999,851,43410.268999999993,851,40803.619999999995]
[852,3977.0277500000002,852,39433.241249999992,852,13481.449999999999,852,43410.268999999993,852,40803.619999999995]
[853,3977.0277500000002,853,39433.241249999992,853,13481.449999999999,853,43410.268999999993,853,40803.619999999995]
[854,3977.0277500000002,854,39433.241249999992,854,13481.449999999999,854,43410.268999999993,854,40803.619999999995]
[855,3977.0277500000002,855,39433.241249999992,855,13481.449999999999,855,43410.268999999993,855,40803.619999999995]
[856,3977.0277500000002,856,39433.241249999992,856,13481.449999999999,856,43410.268999999993,856,40803.619999999995]
[857,3977.0277500000002,857,39433.241249999992,857,13481.449999999999,857,43410.268999999993,857,40803.619999999995]
[858,3977.0277500000002,858,39433.241249999992,858,13481.449999999999,858,43410.268999999993,858,40803.619999999995]
[859,3977.0277500000002,859,39433.241249999992,859,13481.449999999999,859,43410.268999999993,859,40803.619999999995]
[860,3977.0277500000002,860,39433.241249999992,860,13481.449999999999,860,43410.268999999993,860,40803.619999999995]
[861,3977.0277500000002,861,39433.241249999992,861,13481.449999999999,861,43410.268999999993,861,40803.619999999995]
[862,3977.0277500000002,862,39433.241249999992,862,13481.449999999999,862,43410.268999999993,862,40803.619999999995]
[863,3977.0277500000002,863,39433.241249999992,863,13481.449999999999,863,43410.268999999993,863,40803.619999999995]
[864,3977.0277500000002,864,39433.241249999992,864,13481.449999999999,864,43410.268999999993,864,40803.619999999995]
[865,3977.0277500000002,865,39433.241249999992,865,13481.449999999999,865,43410.268999999993,865,40803.619999999995]
[866,3977.0277500000002,866,39433.241249999992,866,13481.449999999999,866,43410.268999999993,866,40803.619999999995]
[867,3977.0277500000002,867,39433.241249999992,867,13481.449999999999,867,43410.268999999993,867,40803.619999999995]
[868,3977.0277500000002,868,39433.241249999992,868,13481.449999999999,868,43410.268999999993,868,40803.619999999995]
[869,3977.0277500000002,869,39433.241249999992,869,13481.449999999999,869,43410.268999999993,869,40803.619999999995]
[870,3977.0277500000002,870,39433.241249999992,870,13481.449999999999,870,43410.268999999993,870,40803.619999999995]
[871,3977.0277500000002,871,39433.241249999992,871,13481.449999999999,871,43410.268999999993,871,40803.619999999995]
[872,3977.0277500000002,872,39433.241249999992,872,13481.449999999999,872,43410.268999999993,872,40803.619999999995]
[873,3977.0277500000002,873,39433.241249999992,873,13481.449999999999,873,43410.268999999993,873,40803.619999999995]
[874,3977.0277500000002,874,39433.241249999992,874,13481.449999999999,874,43410.268999999993,874,40803.619999999995]
[875,3977.0277500000002,875,39433.241249999992,875,13481.449999999999,875,43410.268999999993,875,40803.619999999995]
[876,3977.0277500000002,876,39433.241249999992,876,13481.449999999999,876,43410.268999999993,876,40803.619999999995]
[877,3977.0277500000002,877,39433.241249999992,877,13481.449999999999,877,43410.268999999993,877,40803.619999999995]
[878,3977.0277500000002,878,39433.241249999992,878,13481.449999999999,878,43410.268999999993,878,40803.619999999995]
[879,3977.0277500000002,879,39433.241249999992,879,13481.449999999999,879,43410.268999999993,879,40803.619999999995]
[880,3977.0277500000002,880,39433.241249999992,880,13481.449999999999,880,43410.268999999993,880,40803.619999999995]
[881,3977.0277500000002,881,39433.241249999992,881,13481.449999999999,881,43410.268999999993,881,40803.619999999995]
[882,3977.0277500000002,882,39433.241249999992,882,13481.449999999999,882,43410.268999999993,882,40803.619999999995]
[883,3977.0277500000002,883,39433.241249999992,883,13481.449999999999,883,43410.268999999993,883,40803.619999999995]
[884,3977.0277500000002,884,39433.241249999992,884,13481.449999999999,884,43410.268999999993,884,40803.619999999995]
[885,3977.0277500000002,885,39433.241249999992,885,13481.449999999999,885,43410.268999999993,885,40803.619999999995]
[886,3977.0277500000002,886,39433.241249999992,886,13481.449999999999,886,43410.268999999993,886,40803.619999999995]
[887,3977.0277500000002,887,39433.241249999992,887,13481.449999999999,887,43410.268999999993,887,40803.619999999995]
[888,3977.0277500000002,888,39433.241249999992,888,13481.449999999999,888,43410.268999999993,888,40803.619999999995]
[889,3977.0277500000002,889,39433.241249999992,889,13481.449999999999,889,43410.268999999993,889,40803.619999999995]
[890,3977.0277500000002,890,39433.241249999992,890,13481.449999999999,890,43410.268999999993,890,40803.619999999995]
[891,3977.0277500000002,891,39433.241249999992,891,13481.449999999999,891,43410.268999999993,891,40803.619999999995]
[892,3977.0277500000002,892,39433.241249999992,892,13481.449999999999,892,43410.268999999993,892,40803.619999999995]
[893,3977.0277500000002,893,39433.241249999992,893,13481.449999999999,893,43410.268999999993,893,40803.619999999995]
[894,3977.0277500000002,894,39433.241249999992,894,13481.449999999999,894,43410.268999999993,894,40803.619999999995]
[895,3977.0277500000002,895,39433.241249999992,895,13481.449999999999,895,43410.268999999993,895,40803.619999999995]
[896,3977.0277500000002,896,39433.241249999992,896,13481.449999999999,896,43410.268999999993,896,40803.619999999995]
[897,3977.0277500000002,897,39433.241249999992,897,13481.449999999999,897,43410.268999999993,897,40803.619999999995]
[898,3977.0277500000002,898,39433.241249999992,898,13481.449999999999,898,43410.268999999993,898,40803.619999999995]
[899,3977.0277500000002,899,39433.241249999992,899,13481.449999999999,899,43410.268999999993,899,40803.619999999995]
[900,3977.0277500000002,900,39433.241249999992,900,13481.449999999999,900,43410.268999999993,900,40803.619999999995]
[901,3977.0277500000002,901,39433.241249999992,901,13481.449999999999,901,43410.268999999993,901,40803.619999999995]
[902,3977.0277500000002,902,39433.241249999992,902,13481.449999999999,902,43410.268999999993,902,40803.619999999995]
[903,3977.0277500000002,903,39433.241249999992,903,13481.449999999999,903,43410.268999999993,903,40803.619999999995]
[904,3977.0277500000002,904,39433.241249999992,904,13481.449999999999,904,43410.268999999993,904,40803.619999999995]
[905,3977.0277500000002,905,39433.241249999992,905,13481.449999999999,905,43410.268999999993,905,40803.619999999995]
[906,3977.0277500000002,906,39433.241249999992,906,13481.449999999999,906,43410.268999999993,906,40803.619999999995]
[907,3977.0277500000002,907,39433.241249999992,907,13481.449999999999,907,43410.268999999993,907,40803.619999999995]
[908,3977.0277500000002,908,39433.241249999992,908,13481.449999999999,908,43410.268999999993,908,40803.619999999995]
[909,3977.0277500000002,909,39433.241249999992,909,13481.449999999999,909,43410.268999999993,909,40803.619999999995]
[910,3977.0277500000002,910,39433.241249999992,910,13481.449999999999,910,43410.268999999993,910,40803.619999999995]
[911,3977.0277500000002,911,39433.241249999992,911,13481.449999999999,911,43410.268999999993,911,40803.619999999995]
[912,3977.0277500000002,912,39433.241249999992,912,13481.449999999999,912,43410.268999999993,912,40803.619999999995]
[913,3977.0277500000002,913,39433.241249999992,913,13481.449999999999,913,43410.268999999993,913,40803.619999999995]
[914,3977.0277500000002,914,39433.241249999992,914,13481.449999999999,914,43410.268999999993,914,40803.619999999995]
[915,3977.0277500000002,915,39433.241249999992,915,13481.449999999999,915,43410.268999999993,915,40803.619999999995]
[916,3977.0277500000002,916,39433.241249999992,916,13481.449999999999,916,43410.268999999993,916,40803.619999999995]
[917,3977.0277500000002,917,39433.241249999992,917,13481.449999999999,917,43410.268999999993,917,40803.619999999995]
[918,3977.0277500000002,918,39433.241249999992,918,13481.449999999999,918,43410.268999999993,918,40803.619999999995]
[919,3977.0277500000002,919,39433.241249999992,919,13481.449999999999,919,43410.268999999993,919,40803.619999999995]
[920,3977.0277500000002,920,39433.241249999992,920,13481.449999999999,920,43410.268999999993,920,40803.619999999995]
[921,3977.0277500000002,921,39433.241249999992,921,13481.449999999999,921,43410.268999999993,921,40803.619999999995]
[922,3977.0277500000002,922,39433.241249999992,922,13481.449999999999,922,43410.268999999993,922,40803.619999999995]
[923,3977.0277500000002,923,39433.241249999992,923,13481.449999999999,923,43410.268999999993,923,40803.619999999995]
[924,3977.0277500000002,924,39433.241249999992,924,13481.449999999999,924,43410.268999999993,924,40803.619999999995]
[925,3977.0277500000002,925,39433.241249999992,925,13481.449999999999,925,43410.268999999993,925,40803.619999999995]
[926,3977.0277500000002,926,39433.241249999992,926,13481.449999999999,926,43410.268999999993,926,40803.619999999995]
[927,3977.0277500000002,927,39433.241249999992,927,13481.449999999999,927,43410.268999999993,927,40803.619999999995]
[928,3977.0277500000002,928,39433.241249999992,928,13481.449999999999,928,43410.268999999993,928,40803.619999999995]
[929,3977.0277500000002,929,39433.241249999992,929,13481.449999999999,929,43410.268999999993,929,40803.619999999995]
[930,3977.0277500000002,930,39433.241249999992,930,13481.449999999999,930,43410.268999999993,930,40803.619999999995]
[931,3977.0277500000002,931,39433.241249999992,931,13481.449999999999,931,43410.268999999993,931,40803.619999999995]
[932,3977.0277500000002,932,39433.241249999992,932,13481.449999999999,932,43410.268999999993,932,40803.619999999995]
[933,3977.0277500000002,933,39433.241249999992,933,13481.449999999999,933,43410.268999999993,933,40803.619999999995]
[934,3977.0277500000002,934,39433.241249999992,934,13481.449999999999,934,43410.268999999993,934,40803.619999999995]
[935,3977.0277500000002,935,39433.241249999992,935,13481.449999999999,935,43410.268999999993,935,40803.619999999995]
[936,3977.0277500000002,936,39433.241249999992,936,13481.449999999999,936,43410.268999999993,936,40803.619999999995]
[937,3977.0277500000002,937,39433.241249999992,937,13481.449999999999,937,43410.268999999993,937,40803.619999999995]
[938,3977.0277500000002,938,39433.241249999992,938,13481.449999999999,938,43410.268999999993,938,40803.619999999995]
[939,3977.0277500000002,939,39433.241249999992,939,13481.449999999999,939,43410.268999999993,939,40803.619999999995]
[940,3977.0277500000002,940,39433.241249999992,940,13481.449999999999,940,43410.268999999993,940,40803.619999999995]
[941,3977.0277500000002,941,39433.241249999992,941,13481.449999999999,941,43410.268999999993,941,40803.619999999995]
[942,3977.0277500000002,942,39433.241249999992,942,13481.449999999999,942,43410.268999999993,942,40803.619999999995]
[943,3977.0277500000002,943,39433.241249999992,943,13481.449999999999,943,43410.268999999993,943,40803.619999999995]
[944,3977.0277500000002,944,39433.241249999992,944,13481.449999999999,944,43410.268999999993,944,40803.619999999995]
[945,3977.0277500000002,945,39433.241249999992,945,13481.449999999999,945,43410.268999999993,945,40803.619999999995]
[946,3977.0277500000002,946,39433.241249999992,946,13481.449999999999,946,43410.268999999993,946,40803.619999999995]
[947,3977.0277500000002,947,39433.241249999992,947,13481.449999999999,947,43410.268999999993,947,40803.619999999995]
[948,3977.0277500000002,948,39433.241249999992,948,13481.449999999999,948,43410.268999999993,948,40803.619999999995]
[949,3977.0277500000002,949,39433.241249999992,949,13481.449999999999,949,43410.268999999993,949,40803.619999999995]
[950,3977.0277500000002,950,39433.241249999992,950,13481.449999999999,950,43410.268999999993,950,40803.619999999995]
[951,3977.0277500000002,951,39433.241249999992,951,13481.449999999999,951,43410.268999999993,951,40803.619999999995]
[952,3977.0277500000002,952,39433.241249999992,952,13481.449999999999,952,43410.268999999993,952,40803.619999999995]
[953,3977.0277500000002,953,39433.241249999992,953,13481.449999999999,953,43410.268999999993,953,40803.619999999995]
[954,3977.0277500000002,954,39433.241249999992,954,13481.449999999999,954,43410.268999999993,954,40803.619999999995]
[955,3977.0277500000002,955,39433.241249999992,955,13481.449999999999,955,43410.268999999993,955,40803.619999999995]
[956,3977.0277500000002,956,39433.241249999992,956,13481.449999999999,956,43410.268999999993,956,40803.619999999995]
[957,3977.0277500000002,957,39433.241249999992,957,13481.449999999999,957,43410.268999999993,957,40803.619999999995]
[958,3977.0277500000002,958,39433.241249999992,958,13481.449999999999,958,43410.268999999993,958,40803.619999999995]
[959,3977.0277500000002,959,39433.241249999992,959,13481.449999999999,959,43410.268999999993,959,40803.619999999995]
[960,3977.0277500000002,960,39433.241249999992,960,13481.449999999999,960,43410.268999999993,960,40803.619999999995]
[961,3977.0277500000002,961,39433.241249999992,961,13481.449999999999,961,43410.268999999993,961,40803.619999999995]
[962,3977.0277500000002,962,39433.241249999992,962,13481.449999999999,962,43410.268999999993,962,40803.619999999995]
[963,3977.0277500000002,963,39433.241249999992,963,13481.449999999999,963,43410.268999999993,963,40803.619999999995]
[964,3977.0277500000002,964,39433.241249999992,964,13481.449999999999,964,43410.268999999993,964,40803.619999999995]
[965,3977.0277500000002,965,39433.241249999992,965,13481.449999999999,965,43410.268999999993,965,40803.619999999995]
[966,3977.0277500000002,966,39433.241249999992,966,13481.449999999999,966,43410.268999999993,966,40803.619999999995]
[967,3977.0277500000002,967,39433.241249999992,967,13481.449999999999,967,43410.268999999993,967,40803.619999999995]
[968,3977.0277500000002,968,39433.241249999992,968,13481.449999999999,968,43410.268999999993,968,40803.619999999995]
[969,3977.0277500000002,969,39433.241249999992,969,13481.449999999999,969,43410.268999999993,969,40803.619999999995]
[970,3977.0277500000002,970,39433.241249999992,970,13481.449999999999,970,43410.268999999993,970,40803.619999999995]
[971,3977.0277500000002,971,39433.241249999992,971,13481.449999999999,971,43410.268999999993,971,40803.619999999995]
[972,3977.0277500000002,972,39433.241249999992,972,13481.449999999999,972,43410.268999999993,972,40803.619999999995]
[973,3977.0277500000002,973,39433.241249999992,973,13481.449999999999,973,43410.268999999993,973,40803.619999999995]
[974,3977.0277500000002,974,39433.241249999992,974,13481.449999999999,974,43410.268999999993,974,40803.619999999995]
[975,3977.0277500000002,975,39433.241249999992,975,13481.449999999999,975,43410.268999999993,975,40803.619999999995]
[976,3977.0277500000002,976,39433.241249999992,976,13481.449999999999,976,43410.268999999993,976,40803.619999999995]
[977,3977.0277500000002,977,39433.241249999992,977,13481.449999999999,977,43410.268999999993,977,40803.619999999995]
[978,3977.0277500000002,978,39433.241249999992,978,13481.449999999999,978,43410.268999999993,978,40803.619999999995]
[979,3977.0277500000002,979,39433.241249999992,979,13481.449999999999,979,43410.268999999993,979,40803.619999999995]
[980,3977.0277500000002,980,39433.241249999992,980,13481.449999999999,980,43410.268999999993,980,40803.619999999995]
[981,3977.0277500000002,981,39433.241249999992,981,13481.449999999999,981,43410.268999999993,981,40803.619999999995]
[982,3977.0277500000002,982,39433.241249999992,982,13481.449999999999,982,43410.268999999993,982,40803.619999999995]
[983,3977.0277500000002,983,39433.241249999992,983,13481.449999999999,983,43410.268999999993,983,40803.619999999995]
[984,3977.0277500000002,984,39433.241249999992,984,13481.449999999999,984,43410.268999999993,984,40803.619999999995]
[985,3977.0277500000002,985,39433.241249999992,985,13481.449999999999,985,43410.268999999993,985,40803.619999999995]
[986,3977.0277500000002,986,39433.241249999992,986,13481.449999999999,986,43410.268999999993,986,40803.619999999995]
[987,3977.0277500000002,987,39433.241249999992,987,13481.449999999999,987,43410.268999999993,987,40803.619999999995]
[988,3977.0277500000002,988,39433.241249999992,988,13481.449999999999,988,43410.268999999993,988,40803.619999999995]
[989,3977.0277500000002,989,39433.241249999992,989,13481.449999999999,989,43410.268999999993,989,40803.619999999995]
[990,3977.0277500000002,990,39433.241249999992,990,13481.449999999999,990,43410.268999999993,990,40803.619999999995]
[991,3977.0277500000002,991,39433.241249999992,991,13481.449999999999,991,43410.268999999993,991,40803.619999999995]
[992,3977.0277500000002,992,39433.241249999992,992,13481.449999999999,992,43410.268999999993,992,40803.619999999995]
[993,3977.0277500000002,993,39433.241249999992,993,13481.449999999999,993,43410.268999999993,993,40803.619999999995]
[994,3977.0277500000002,994,39433.241249999992,994,13481.449999999999,994,43410.268999999993,994,40803.619999999995]
[995,3977.0277500000002,995,39433.241249999992,995,13481.449999999999,995,43410.268999999993,995,40803.619999999995]
[996,3977.0277500000002,996,39433.241249999992,996,13481.449999999999,996,43410.268999999993,996,40803.619999999995]
[997,3977.0277500000002,997,39433.241249999992,997,13481.449999999999,997,43410.268999999993,997,40803.619999999995]
[998,3977.0277500000002,998,39433.241249999992,998,13481.449999999999,998,43410.268999999993,998,40803.619999999995]
[999,3977.0277500000002,999,39433.241249999992,999,13481.449999999999,999,43410.268999999993,999,40803.619999999995]
[1000,3977.0277500000002,1000,39433.241249999992,1000,13481.449999999999,1000,43410.268999999993,1000,40803.619999999995]